==> Synchronizing chroot copy [/chroot/armv6/root] -> [build]...done
==> Making package: videosnarf 0.63-2 (Mon Mar  4 21:38:33 2019)
==> Retrieving sources...
  -> Found videosnarf-0.63.tar.gz
  -> Found videosnarf-0.63-fix-linking.patch
==> Validating source files with sha512sums...
    videosnarf-0.63.tar.gz ... Passed
    videosnarf-0.63-fix-linking.patch ... Passed
Host and machine ids are equal (508bc9faf65540dfb4fb1551fd5fdc0a): refusing to link journals
==> Making package: videosnarf 0.63-2 (Mon 04 Mar 2019 09:38:39 PM EST)
==> Checking runtime dependencies...
==> Checking buildtime dependencies...
==> Installing missing dependencies...
resolving dependencies...
looking for conflicting packages...

Packages (1) libnet-1.1.6-3

Total Installed Size:  0.32 MiB

:: Proceed with installation? [Y/n] 
checking keyring...
checking package integrity...
loading package files...
checking for file conflicts...
checking available disk space...
:: Processing package changes...
installing libnet...
:: Running post-transaction hooks...
(1/1) Arming ConditionNeedsUpdate...
==> Retrieving sources...
  -> Found videosnarf-0.63.tar.gz
  -> Found videosnarf-0.63-fix-linking.patch
==> WARNING: Skipping all source file integrity checks.
==> Extracting sources...
  -> Extracting videosnarf-0.63.tar.gz with bsdtar
==> Starting build()...
patching file configure.in
patching file src/Makefile.am
aclocal: warning: autoconf input should be named 'configure.ac', not 'configure.in'
automake: warning: autoconf input should be named 'configure.ac', not 'configure.in'
configure.in:4: warning: AM_INIT_AUTOMAKE: two- and three-arguments forms are deprecated.  For more info, see:
configure.in:4: https://www.gnu.org/software/automake/manual/automake.html#Modernize-AM_005fINIT_005fAUTOMAKE-invocation
configure.in:6: installing './compile'
automake: warning: autoconf input should be named 'configure.ac', not 'configure.in'
checking for a BSD-compatible install... /usr/bin/install -c
checking whether build environment is sane... yes
checking for a thread-safe mkdir -p... /usr/bin/mkdir -p
checking for gawk... gawk
checking whether make sets $(MAKE)... yes
checking whether make supports nested variables... yes
checking build system type... armv7l-unknown-linux-gnueabihf
checking host system type... armv7l-unknown-linux-gnueabihf
checking for gcc... gcc
checking whether the C compiler works... yes
checking for C compiler default output file name... a.out
checking for suffix of executables... 
checking whether we are cross compiling... no
checking for suffix of object files... o
checking whether we are using the GNU C compiler... yes
checking whether gcc accepts -g... yes
checking for gcc option to accept ISO C89... none needed
checking whether gcc understands -c and -o together... yes
checking whether make supports the include directive... yes (GNU style)
checking dependency style of gcc... gcc3
checking for g++... g++
checking whether we are using the GNU C++ compiler... yes
checking whether g++ accepts -g... yes
checking dependency style of g++... gcc3
checking how to run the C preprocessor... gcc -E
checking for grep that handles long lines and -e... /usr/bin/grep
checking for egrep... /usr/bin/grep -E
checking whether gcc needs -traditional... no
checking for pcap_compile in -lpcap... yes
checking that generated files are newer than configure... done
configure: creating ./config.status
config.status: creating Makefile
config.status: creating src/Makefile
config.status: creating src/config.h
config.status: executing depfiles commands
Making all in src
make[1]: Entering directory '/build/videosnarf/src/videosnarf-0.63/src'
make  all-am
make[2]: Entering directory '/build/videosnarf/src/videosnarf-0.63/src'
gcc -DHAVE_CONFIG_H -I.   -D_FORTIFY_SOURCE=2  -march=armv6 -mfloat-abi=hard -mfpu=vfpv3-d16 -O2 -pipe -fstack-protector --param=ssp-buffer-size=4 -MT main.o -MD -MP -MF .deps/main.Tpo -c -o main.o main.c
mv -f .deps/main.Tpo .deps/main.Po
gcc -DHAVE_CONFIG_H -I.   -D_FORTIFY_SOURCE=2  -march=armv6 -mfloat-abi=hard -mfpu=vfpv3-d16 -O2 -pipe -fstack-protector --param=ssp-buffer-size=4 -MT stream.o -MD -MP -MF .deps/stream.Tpo -c -o stream.o stream.c
mv -f .deps/stream.Tpo .deps/stream.Po
gcc -DHAVE_CONFIG_H -I.   -D_FORTIFY_SOURCE=2  -march=armv6 -mfloat-abi=hard -mfpu=vfpv3-d16 -O2 -pipe -fstack-protector --param=ssp-buffer-size=4 -MT videosnarf.o -MD -MP -MF .deps/videosnarf.Tpo -c -o videosnarf.o videosnarf.c
videosnarf.c: In function ‘decode_ip’:
videosnarf.c:454:21: warning: implicit declaration of function ‘initialize_g729_decoder’ [-Wimplicit-function-declaration]
      int g729_ret = initialize_g729_decoder(currentMS);
                     ^~~~~~~~~~~~~~~~~~~~~~~
videosnarf.c:462:21: warning: implicit declaration of function ‘decode_payload_g729’; did you mean ‘egre_payload_s’? [-Wimplicit-function-declaration]
     int g729_dret = decode_payload_g729(currentMS, payload, size_payload);
                     ^~~~~~~~~~~~~~~~~~~
                     egre_payload_s
videosnarf.c:493:21: warning: implicit declaration of function ‘initialize_g723_decoder’ [-Wimplicit-function-declaration]
      int g723_ret = initialize_g723_decoder(currentMS, frameType);
                     ^~~~~~~~~~~~~~~~~~~~~~~
videosnarf.c:501:20: warning: implicit declaration of function ‘decode_payload_g723’; did you mean ‘egre_payload_s’? [-Wimplicit-function-declaration]
     int g723_ret = decode_payload_g723(currentMS, payload, size_payload, frameType);
                    ^~~~~~~~~~~~~~~~~~~
                    egre_payload_s
videosnarf.c:525:36: warning: implicit declaration of function ‘initialize_g726_decoder’ [-Wimplicit-function-declaration]
                     int g726_ret = initialize_g726_decoder(currentMS);
                                    ^~~~~~~~~~~~~~~~~~~~~~~
videosnarf.c:533:32: warning: implicit declaration of function ‘decode_payload_g726’; did you mean ‘egre_payload_s’? [-Wimplicit-function-declaration]
                 int g726_ret = decode_payload_g726(currentMS, payload, size_payload,g726SampleSize);
                                ^~~~~~~~~~~~~~~~~~~
                                egre_payload_s
mv -f .deps/videosnarf.Tpo .deps/videosnarf.Po
gcc -DHAVE_CONFIG_H -I.   -D_FORTIFY_SOURCE=2  -march=armv6 -mfloat-abi=hard -mfpu=vfpv3-d16 -O2 -pipe -fstack-protector --param=ssp-buffer-size=4 -MT h264rtp.o -MD -MP -MF .deps/h264rtp.Tpo -c -o h264rtp.o h264rtp.c
mv -f .deps/h264rtp.Tpo .deps/h264rtp.Po
gcc -DHAVE_CONFIG_H -I.   -D_FORTIFY_SOURCE=2  -march=armv6 -mfloat-abi=hard -mfpu=vfpv3-d16 -O2 -pipe -fstack-protector --param=ssp-buffer-size=4 -MT g722_decode.o -MD -MP -MF .deps/g722_decode.Tpo -c -o g722_decode.o g722_decode.c
mv -f .deps/g722_decode.Tpo .deps/g722_decode.Po
gcc -DHAVE_CONFIG_H -I.   -D_FORTIFY_SOURCE=2  -march=armv6 -mfloat-abi=hard -mfpu=vfpv3-d16 -O2 -pipe -fstack-protector --param=ssp-buffer-size=4 -MT g726_decoder.o -MD -MP -MF .deps/g726_decoder.Tpo -c -o g726_decoder.o g726_decoder.c
g726_decoder.c: In function ‘initialize_g726_decoder’:
g726_decoder.c:12:22: warning: implicit declaration of function ‘create_wav_header’ [-Wimplicit-function-declaration]
     int return_wav = create_wav_header(currentMS->fp, 1, 16, 8000, 1);
                      ^~~~~~~~~~~~~~~~~
mv -f .deps/g726_decoder.Tpo .deps/g726_decoder.Po
g++ -DHAVE_CONFIG_H -I.   -D_FORTIFY_SOURCE=2  -march=armv6 -mfloat-abi=hard -mfpu=vfpv3-d16 -O2 -pipe -fstack-protector --param=ssp-buffer-size=4 -MT g729_decoder.o -MD -MP -MF .deps/g729_decoder.Tpo -c -o g729_decoder.o g729_decoder.cpp
mv -f .deps/g729_decoder.Tpo .deps/g729_decoder.Po
g++ -DHAVE_CONFIG_H -I.   -D_FORTIFY_SOURCE=2  -march=armv6 -mfloat-abi=hard -mfpu=vfpv3-d16 -O2 -pipe -fstack-protector --param=ssp-buffer-size=4 -MT g723_decoder.o -MD -MP -MF .deps/g723_decoder.Tpo -c -o g723_decoder.o g723_decoder.cpp
mv -f .deps/g723_decoder.Tpo .deps/g723_decoder.Po
g++  -march=armv6 -mfloat-abi=hard -mfpu=vfpv3-d16 -O2 -pipe -fstack-protector --param=ssp-buffer-size=4  -Wl,-O1,--sort-common,--as-needed,-z,relro -o videosnarf main.o stream.o videosnarf.o h264rtp.o g722_decode.o g726_decoder.o g729_decoder.o g723_decoder.o ../codec-lib/libG729a.a ../codec-lib/libG7231.a ../codec-lib/libG726.a -lpcap 
/usr/bin/ld: ../codec-lib/libG729a.a(EasyG729A.o): relocations in generic ELF (EM: 3)
/usr/bin/ld: ../codec-lib/libG729a.a(EasyG729A.o): relocations in generic ELF (EM: 3)
/usr/bin/ld: ../codec-lib/libG729a.a: error adding symbols: file in wrong format
collect2: error: ld returned 1 exit status
make[2]: *** [Makefile:395: videosnarf] Error 1
make[2]: Leaving directory '/build/videosnarf/src/videosnarf-0.63/src'
make[1]: *** [Makefile:302: all] Error 2
make[1]: Leaving directory '/build/videosnarf/src/videosnarf-0.63/src'
make: *** [Makefile:348: all-recursive] Error 1
==> ERROR: A failure occurred in build().
    Aborting...
==> Removing installed dependencies...
checking dependencies...

Packages (1) libnet-1.1.6-3

Total Removed Size:  0.32 MiB

:: Do you want to remove these packages? [Y/n] 
:: Processing package changes...
removing libnet...
:: Running post-transaction hooks...
(1/1) Arming ConditionNeedsUpdate...
==> ERROR: Build failed, check /chroot/armv6/build/build