==> Synchronizing chroot copy [/chroot/armv8/root] -> [build]...done
==> Making package: spiped 1.6.1.99-1 (Wed Dec 15 16:14:48 2021)
==> Retrieving sources...
  -> Found spiped-1.6.1.99.tgz
==> WARNING: Skipping verification of source file PGP signatures.
==> Validating source files with sha512sums...
    spiped-1.6.1.99.tgz ... Passed
==> Making package: spiped 1.6.1.99-1 (Wed 15 Dec 2021 04:15:11 PM UTC)
==> Checking runtime dependencies...
==> Checking buildtime dependencies...
==> Retrieving sources...
  -> Found spiped-1.6.1.99.tgz
==> WARNING: Skipping all source file integrity checks.
==> Extracting sources...
  -> Extracting spiped-1.6.1.99.tgz with bsdtar
==> Starting build()...
if [ -d libcperciva/POSIX/ ]; then			\
	export CC="c99";					\
	cd libcperciva/POSIX;				\
	command -p sh posix-cflags-filter.sh "$PATH";		\
fi > cflags-filter.sh
if [ ! -s cflags-filter.sh ]; then						\
	printf "# Compiler understands normal flags; ";		\
	printf "nothing to filter out\n";			\
fi >> cflags-filter.sh
if [ -d libcperciva/cpusupport/ ]; then			\
	export CC="c99";					\
	command -p sh						\
	    libcperciva/cpusupport/Build/cpusupport.sh	\
	    "$PATH";						\
fi > cpusupport-config.h
Checking if compiler supports HWCAP ELF_AUX_INFO feature... no
Checking if compiler supports HWCAP GETAUXVAL feature... yes
Checking if compiler supports X86 CPUID feature... no
Checking if compiler supports X86 CPUID_COUNT feature... no
Checking if compiler supports X86 AESNI feature... no
Checking if compiler supports X86 RDRAND feature... no
Checking if compiler supports X86 SHANI feature... no
Checking if compiler supports X86 SSE2 feature... no
Checking if compiler supports X86 SSSE3 feature... no
Checking if compiler supports ARM AES feature... yes, via -march=armv8.1-a+crypto
Checking if compiler supports ARM SHA256 feature... yes, via -march=armv8.1-a+crypto
if [ ! -s cpusupport-config.h ]; then						\
	printf "#define CPUSUPPORT_NONE 1\n";			\
fi >> cpusupport-config.h
if [ -d libcperciva/POSIX/ ]; then			\
	export CC="c99";					\
	cd libcperciva/POSIX;				\
	printf "export \"LDADD_POSIX=";				\
	command -p sh posix-l.sh "$PATH";			\
	printf "\"\n";						\
	printf "export \"CFLAGS_POSIX=";			\
	command -p sh posix-cflags.sh "$PATH";			\
	printf "\"\n";						\
fi > posix-flags.sh
WARNING: POSIX violation: c99 does not understand -lxnet
if [ ! -s posix-flags.sh ]; then						\
	printf "#define POSIX_COMPATIBILITY_NOT_CHECKED 1\n";	\
fi >> posix-flags.sh
. ./posix-flags.sh;				\
. ./cpusupport-config.h;			\
. ./cflags-filter.sh;				\
export HAVE_BUILD_FLAGS=1;			\
( cd liball && make all ) || exit 2;
make[1]: Entering directory '/build/spiped/src/spiped-1.6.1.99/liball'
if [ -z "${HAVE_BUILD_FLAGS}" ]; then \
	cd ..; \
	make BUILD_SUBDIR=liball \
	    BUILD_TARGET= buildsubdir; \
else \
	make liball.a; \
fi
make[2]: Entering directory '/build/spiped/src/spiped-1.6.1.99/liball'
c99  -D_POSIX_C_SOURCE=200809L -D_XOPEN_SOURCE=700 -DCPUSUPPORT_CONFIG_FILE=\"cpusupport-config.h\"  -I.. -I../libcperciva/alg -I../libcperciva/cpusupport -I../libcperciva/crypto -I../libcperciva/datastruct -I../libcperciva/events -I../libcperciva/netbuf -I../libcperciva/network -I../libcperciva/util -I../lib/dnsthread -I../lib/proto -I../lib/util -D_FORTIFY_SOURCE=2 -march=armv8-a -O2 -pipe -fstack-protector --param=ssp-buffer-size=4 -c ../libcperciva/alg/sha256.c -o sha256.o
c99  -D_POSIX_C_SOURCE=200809L -D_XOPEN_SOURCE=700 -DCPUSUPPORT_CONFIG_FILE=\"cpusupport-config.h\" -march=armv8.1-a+crypto -I.. -I../libcperciva/alg -I../libcperciva/cpusupport -I../libcperciva/crypto -I../libcperciva/datastruct -I../libcperciva/events -I../libcperciva/netbuf -I../libcperciva/network -I../libcperciva/util -I../lib/dnsthread -I../lib/proto -I../lib/util -D_FORTIFY_SOURCE=2 -march=armv8-a -O2 -pipe -fstack-protector --param=ssp-buffer-size=4 -c ../libcperciva/alg/sha256_arm.c -o sha256_arm.o
In file included from ../libcperciva/alg/sha256_arm.c:12:
../libcperciva/alg/sha256_arm.c: In function ‘SHA256_Transform_arm’:
/usr/lib/gcc/aarch64-unknown-linux-gnu/10.2.0/include/arm_neon.h:26624:1: error: inlining failed in call to ‘always_inline’ ‘vsha256h2q_u32’: target specific option mismatch
26624 | vsha256h2q_u32 (uint32x4_t __hash_efgh, uint32x4_t __hash_abcd, uint32x4_t __wk)
      | ^~~~~~~~~~~~~~
../libcperciva/alg/sha256_arm.c:44:10: note: called from here
   44 |   S[1] = vsha256h2q_u32(S[1], S0_step, Wk); \
      |          ^~~~~~~~~~~~~~~~~~~~~~~~~~~~~~~~~
../libcperciva/alg/sha256_arm.c:88:3: note: in expansion of macro ‘RND4’
   88 |   RND4(S, Y[3], &Krnd[i + 12]);
      |   ^~~~
In file included from ../libcperciva/alg/sha256_arm.c:12:
/usr/lib/gcc/aarch64-unknown-linux-gnu/10.2.0/include/arm_neon.h:26616:1: error: inlining failed in call to ‘always_inline’ ‘vsha256hq_u32’: target specific option mismatch
26616 | vsha256hq_u32 (uint32x4_t __hash_abcd, uint32x4_t __hash_efgh, uint32x4_t __wk)
      | ^~~~~~~~~~~~~
../libcperciva/alg/sha256_arm.c:43:10: note: called from here
   43 |   S[0] = vsha256hq_u32(S[0], S[1], Wk);  \
      |          ^~~~~~~~~~~~~~~~~~~~~~~~~~~~~
../libcperciva/alg/sha256_arm.c:88:3: note: in expansion of macro ‘RND4’
   88 |   RND4(S, Y[3], &Krnd[i + 12]);
      |   ^~~~
In file included from ../libcperciva/alg/sha256_arm.c:12:
/usr/lib/gcc/aarch64-unknown-linux-gnu/10.2.0/include/arm_neon.h:26624:1: error: inlining failed in call to ‘always_inline’ ‘vsha256h2q_u32’: target specific option mismatch
26624 | vsha256h2q_u32 (uint32x4_t __hash_efgh, uint32x4_t __hash_abcd, uint32x4_t __wk)
      | ^~~~~~~~~~~~~~
../libcperciva/alg/sha256_arm.c:44:10: note: called from here
   44 |   S[1] = vsha256h2q_u32(S[1], S0_step, Wk); \
      |          ^~~~~~~~~~~~~~~~~~~~~~~~~~~~~~~~~
../libcperciva/alg/sha256_arm.c:87:3: note: in expansion of macro ‘RND4’
   87 |   RND4(S, Y[2], &Krnd[i + 8]);
      |   ^~~~
In file included from ../libcperciva/alg/sha256_arm.c:12:
/usr/lib/gcc/aarch64-unknown-linux-gnu/10.2.0/include/arm_neon.h:26616:1: error: inlining failed in call to ‘always_inline’ ‘vsha256hq_u32’: target specific option mismatch
26616 | vsha256hq_u32 (uint32x4_t __hash_abcd, uint32x4_t __hash_efgh, uint32x4_t __wk)
      | ^~~~~~~~~~~~~
../libcperciva/alg/sha256_arm.c:43:10: note: called from here
   43 |   S[0] = vsha256hq_u32(S[0], S[1], Wk);  \
      |          ^~~~~~~~~~~~~~~~~~~~~~~~~~~~~
../libcperciva/alg/sha256_arm.c:87:3: note: in expansion of macro ‘RND4’
   87 |   RND4(S, Y[2], &Krnd[i + 8]);
      |   ^~~~
In file included from ../libcperciva/alg/sha256_arm.c:12:
/usr/lib/gcc/aarch64-unknown-linux-gnu/10.2.0/include/arm_neon.h:26624:1: error: inlining failed in call to ‘always_inline’ ‘vsha256h2q_u32’: target specific option mismatch
26624 | vsha256h2q_u32 (uint32x4_t __hash_efgh, uint32x4_t __hash_abcd, uint32x4_t __wk)
      | ^~~~~~~~~~~~~~
../libcperciva/alg/sha256_arm.c:44:10: note: called from here
   44 |   S[1] = vsha256h2q_u32(S[1], S0_step, Wk); \
      |          ^~~~~~~~~~~~~~~~~~~~~~~~~~~~~~~~~
../libcperciva/alg/sha256_arm.c:86:3: note: in expansion of macro ‘RND4’
   86 |   RND4(S, Y[1], &Krnd[i + 4]);
      |   ^~~~
In file included from ../libcperciva/alg/sha256_arm.c:12:
/usr/lib/gcc/aarch64-unknown-linux-gnu/10.2.0/include/arm_neon.h:26616:1: error: inlining failed in call to ‘always_inline’ ‘vsha256hq_u32’: target specific option mismatch
26616 | vsha256hq_u32 (uint32x4_t __hash_abcd, uint32x4_t __hash_efgh, uint32x4_t __wk)
      | ^~~~~~~~~~~~~
../libcperciva/alg/sha256_arm.c:43:10: note: called from here
   43 |   S[0] = vsha256hq_u32(S[0], S[1], Wk);  \
      |          ^~~~~~~~~~~~~~~~~~~~~~~~~~~~~
../libcperciva/alg/sha256_arm.c:86:3: note: in expansion of macro ‘RND4’
   86 |   RND4(S, Y[1], &Krnd[i + 4]);
      |   ^~~~
In file included from ../libcperciva/alg/sha256_arm.c:12:
/usr/lib/gcc/aarch64-unknown-linux-gnu/10.2.0/include/arm_neon.h:26624:1: error: inlining failed in call to ‘always_inline’ ‘vsha256h2q_u32’: target specific option mismatch
26624 | vsha256h2q_u32 (uint32x4_t __hash_efgh, uint32x4_t __hash_abcd, uint32x4_t __wk)
      | ^~~~~~~~~~~~~~
../libcperciva/alg/sha256_arm.c:44:10: note: called from here
   44 |   S[1] = vsha256h2q_u32(S[1], S0_step, Wk); \
      |          ^~~~~~~~~~~~~~~~~~~~~~~~~~~~~~~~~
../libcperciva/alg/sha256_arm.c:85:3: note: in expansion of macro ‘RND4’
   85 |   RND4(S, Y[0], &Krnd[i + 0]);
      |   ^~~~
In file included from ../libcperciva/alg/sha256_arm.c:12:
/usr/lib/gcc/aarch64-unknown-linux-gnu/10.2.0/include/arm_neon.h:26616:1: error: inlining failed in call to ‘always_inline’ ‘vsha256hq_u32’: target specific option mismatch
26616 | vsha256hq_u32 (uint32x4_t __hash_abcd, uint32x4_t __hash_efgh, uint32x4_t __wk)
      | ^~~~~~~~~~~~~
../libcperciva/alg/sha256_arm.c:43:10: note: called from here
   43 |   S[0] = vsha256hq_u32(S[0], S[1], Wk);  \
      |          ^~~~~~~~~~~~~~~~~~~~~~~~~~~~~
../libcperciva/alg/sha256_arm.c:85:3: note: in expansion of macro ‘RND4’
   85 |   RND4(S, Y[0], &Krnd[i + 0]);
      |   ^~~~
In file included from ../libcperciva/alg/sha256_arm.c:12:
/usr/lib/gcc/aarch64-unknown-linux-gnu/10.2.0/include/arm_neon.h:26624:1: error: inlining failed in call to ‘always_inline’ ‘vsha256h2q_u32’: target specific option mismatch
26624 | vsha256h2q_u32 (uint32x4_t __hash_efgh, uint32x4_t __hash_abcd, uint32x4_t __wk)
      | ^~~~~~~~~~~~~~
../libcperciva/alg/sha256_arm.c:44:10: note: called from here
   44 |   S[1] = vsha256h2q_u32(S[1], S0_step, Wk); \
      |          ^~~~~~~~~~~~~~~~~~~~~~~~~~~~~~~~~
../libcperciva/alg/sha256_arm.c:85:3: note: in expansion of macro ‘RND4’
   85 |   RND4(S, Y[0], &Krnd[i + 0]);
      |   ^~~~
In file included from ../libcperciva/alg/sha256_arm.c:12:
/usr/lib/gcc/aarch64-unknown-linux-gnu/10.2.0/include/arm_neon.h:26616:1: error: inlining failed in call to ‘always_inline’ ‘vsha256hq_u32’: target specific option mismatch
26616 | vsha256hq_u32 (uint32x4_t __hash_abcd, uint32x4_t __hash_efgh, uint32x4_t __wk)
      | ^~~~~~~~~~~~~
../libcperciva/alg/sha256_arm.c:43:10: note: called from here
   43 |   S[0] = vsha256hq_u32(S[0], S[1], Wk);  \
      |          ^~~~~~~~~~~~~~~~~~~~~~~~~~~~~
../libcperciva/alg/sha256_arm.c:85:3: note: in expansion of macro ‘RND4’
   85 |   RND4(S, Y[0], &Krnd[i + 0]);
      |   ^~~~
In file included from ../libcperciva/alg/sha256_arm.c:12:
/usr/lib/gcc/aarch64-unknown-linux-gnu/10.2.0/include/arm_neon.h:26624:1: error: inlining failed in call to ‘always_inline’ ‘vsha256h2q_u32’: target specific option mismatch
26624 | vsha256h2q_u32 (uint32x4_t __hash_efgh, uint32x4_t __hash_abcd, uint32x4_t __wk)
      | ^~~~~~~~~~~~~~
../libcperciva/alg/sha256_arm.c:44:10: note: called from here
   44 |   S[1] = vsha256h2q_u32(S[1], S0_step, Wk); \
      |          ^~~~~~~~~~~~~~~~~~~~~~~~~~~~~~~~~
../libcperciva/alg/sha256_arm.c:86:3: note: in expansion of macro ‘RND4’
   86 |   RND4(S, Y[1], &Krnd[i + 4]);
      |   ^~~~
In file included from ../libcperciva/alg/sha256_arm.c:12:
/usr/lib/gcc/aarch64-unknown-linux-gnu/10.2.0/include/arm_neon.h:26616:1: error: inlining failed in call to ‘always_inline’ ‘vsha256hq_u32’: target specific option mismatch
26616 | vsha256hq_u32 (uint32x4_t __hash_abcd, uint32x4_t __hash_efgh, uint32x4_t __wk)
      | ^~~~~~~~~~~~~
../libcperciva/alg/sha256_arm.c:43:10: note: called from here
   43 |   S[0] = vsha256hq_u32(S[0], S[1], Wk);  \
      |          ^~~~~~~~~~~~~~~~~~~~~~~~~~~~~
../libcperciva/alg/sha256_arm.c:86:3: note: in expansion of macro ‘RND4’
   86 |   RND4(S, Y[1], &Krnd[i + 4]);
      |   ^~~~
In file included from ../libcperciva/alg/sha256_arm.c:12:
/usr/lib/gcc/aarch64-unknown-linux-gnu/10.2.0/include/arm_neon.h:26624:1: error: inlining failed in call to ‘always_inline’ ‘vsha256h2q_u32’: target specific option mismatch
26624 | vsha256h2q_u32 (uint32x4_t __hash_efgh, uint32x4_t __hash_abcd, uint32x4_t __wk)
      | ^~~~~~~~~~~~~~
../libcperciva/alg/sha256_arm.c:44:10: note: called from here
   44 |   S[1] = vsha256h2q_u32(S[1], S0_step, Wk); \
      |          ^~~~~~~~~~~~~~~~~~~~~~~~~~~~~~~~~
../libcperciva/alg/sha256_arm.c:87:3: note: in expansion of macro ‘RND4’
   87 |   RND4(S, Y[2], &Krnd[i + 8]);
      |   ^~~~
In file included from ../libcperciva/alg/sha256_arm.c:12:
/usr/lib/gcc/aarch64-unknown-linux-gnu/10.2.0/include/arm_neon.h:26616:1: error: inlining failed in call to ‘always_inline’ ‘vsha256hq_u32’: target specific option mismatch
26616 | vsha256hq_u32 (uint32x4_t __hash_abcd, uint32x4_t __hash_efgh, uint32x4_t __wk)
      | ^~~~~~~~~~~~~
../libcperciva/alg/sha256_arm.c:43:10: note: called from here
   43 |   S[0] = vsha256hq_u32(S[0], S[1], Wk);  \
      |          ^~~~~~~~~~~~~~~~~~~~~~~~~~~~~
../libcperciva/alg/sha256_arm.c:87:3: note: in expansion of macro ‘RND4’
   87 |   RND4(S, Y[2], &Krnd[i + 8]);
      |   ^~~~
In file included from ../libcperciva/alg/sha256_arm.c:12:
/usr/lib/gcc/aarch64-unknown-linux-gnu/10.2.0/include/arm_neon.h:26624:1: error: inlining failed in call to ‘always_inline’ ‘vsha256h2q_u32’: target specific option mismatch
26624 | vsha256h2q_u32 (uint32x4_t __hash_efgh, uint32x4_t __hash_abcd, uint32x4_t __wk)
      | ^~~~~~~~~~~~~~
../libcperciva/alg/sha256_arm.c:44:10: note: called from here
   44 |   S[1] = vsha256h2q_u32(S[1], S0_step, Wk); \
      |          ^~~~~~~~~~~~~~~~~~~~~~~~~~~~~~~~~
../libcperciva/alg/sha256_arm.c:88:3: note: in expansion of macro ‘RND4’
   88 |   RND4(S, Y[3], &Krnd[i + 12]);
      |   ^~~~
In file included from ../libcperciva/alg/sha256_arm.c:12:
/usr/lib/gcc/aarch64-unknown-linux-gnu/10.2.0/include/arm_neon.h:26616:1: error: inlining failed in call to ‘always_inline’ ‘vsha256hq_u32’: target specific option mismatch
26616 | vsha256hq_u32 (uint32x4_t __hash_abcd, uint32x4_t __hash_efgh, uint32x4_t __wk)
      | ^~~~~~~~~~~~~
../libcperciva/alg/sha256_arm.c:43:10: note: called from here
   43 |   S[0] = vsha256hq_u32(S[0], S[1], Wk);  \
      |          ^~~~~~~~~~~~~~~~~~~~~~~~~~~~~
../libcperciva/alg/sha256_arm.c:88:3: note: in expansion of macro ‘RND4’
   88 |   RND4(S, Y[3], &Krnd[i + 12]);
      |   ^~~~
In file included from ../libcperciva/alg/sha256_arm.c:12:
/usr/lib/gcc/aarch64-unknown-linux-gnu/10.2.0/include/arm_neon.h:26639:1: error: inlining failed in call to ‘always_inline’ ‘vsha256su1q_u32’: target specific option mismatch
26639 | vsha256su1q_u32 (uint32x4_t __tw0_3, uint32x4_t __w8_11, uint32x4_t __w12_15)
      | ^~~~~~~~~~~~~~~
../libcperciva/alg/sha256_arm.c:49:7: note: called from here
   49 |  X0 = vsha256su1q_u32(vsha256su0q_u32(X0, X1), X2, X3)
      |       ^~~~~~~~~~~~~~~~~~~~~~~~~~~~~~~~~~~~~~~~~~~~~~~~
../libcperciva/alg/sha256_arm.c:95:3: note: in expansion of macro ‘MSG4’
   95 |   MSG4(Y[3], Y[0], Y[1], Y[2]);
      |   ^~~~
In file included from ../libcperciva/alg/sha256_arm.c:12:
/usr/lib/gcc/aarch64-unknown-linux-gnu/10.2.0/include/arm_neon.h:26632:1: error: inlining failed in call to ‘always_inline’ ‘vsha256su0q_u32’: target specific option mismatch
26632 | vsha256su0q_u32 (uint32x4_t __w0_3, uint32x4_t __w4_7)
      | ^~~~~~~~~~~~~~~
../libcperciva/alg/sha256_arm.c:49:7: note: called from here
   49 |  X0 = vsha256su1q_u32(vsha256su0q_u32(X0, X1), X2, X3)
      |       ^~~~~~~~~~~~~~~~~~~~~~~~~~~~~~~~~~~~~~~~~~~~~~~~
../libcperciva/alg/sha256_arm.c:95:3: note: in expansion of macro ‘MSG4’
   95 |   MSG4(Y[3], Y[0], Y[1], Y[2]);
      |   ^~~~
In file included from ../libcperciva/alg/sha256_arm.c:12:
/usr/lib/gcc/aarch64-unknown-linux-gnu/10.2.0/include/arm_neon.h:26639:1: error: inlining failed in call to ‘always_inline’ ‘vsha256su1q_u32’: target specific option mismatch
26639 | vsha256su1q_u32 (uint32x4_t __tw0_3, uint32x4_t __w8_11, uint32x4_t __w12_15)
      | ^~~~~~~~~~~~~~~
../libcperciva/alg/sha256_arm.c:49:7: note: called from here
   49 |  X0 = vsha256su1q_u32(vsha256su0q_u32(X0, X1), X2, X3)
      |       ^~~~~~~~~~~~~~~~~~~~~~~~~~~~~~~~~~~~~~~~~~~~~~~~
../libcperciva/alg/sha256_arm.c:94:3: note: in expansion of macro ‘MSG4’
   94 |   MSG4(Y[2], Y[3], Y[0], Y[1]);
      |   ^~~~
In file included from ../libcperciva/alg/sha256_arm.c:12:
/usr/lib/gcc/aarch64-unknown-linux-gnu/10.2.0/include/arm_neon.h:26632:1: error: inlining failed in call to ‘always_inline’ ‘vsha256su0q_u32’: target specific option mismatch
26632 | vsha256su0q_u32 (uint32x4_t __w0_3, uint32x4_t __w4_7)
      | ^~~~~~~~~~~~~~~
../libcperciva/alg/sha256_arm.c:49:7: note: called from here
   49 |  X0 = vsha256su1q_u32(vsha256su0q_u32(X0, X1), X2, X3)
      |       ^~~~~~~~~~~~~~~~~~~~~~~~~~~~~~~~~~~~~~~~~~~~~~~~
../libcperciva/alg/sha256_arm.c:94:3: note: in expansion of macro ‘MSG4’
   94 |   MSG4(Y[2], Y[3], Y[0], Y[1]);
      |   ^~~~
In file included from ../libcperciva/alg/sha256_arm.c:12:
/usr/lib/gcc/aarch64-unknown-linux-gnu/10.2.0/include/arm_neon.h:26639:1: error: inlining failed in call to ‘always_inline’ ‘vsha256su1q_u32’: target specific option mismatch
26639 | vsha256su1q_u32 (uint32x4_t __tw0_3, uint32x4_t __w8_11, uint32x4_t __w12_15)
      | ^~~~~~~~~~~~~~~
../libcperciva/alg/sha256_arm.c:49:7: note: called from here
   49 |  X0 = vsha256su1q_u32(vsha256su0q_u32(X0, X1), X2, X3)
      |       ^~~~~~~~~~~~~~~~~~~~~~~~~~~~~~~~~~~~~~~~~~~~~~~~
../libcperciva/alg/sha256_arm.c:93:3: note: in expansion of macro ‘MSG4’
   93 |   MSG4(Y[1], Y[2], Y[3], Y[0]);
      |   ^~~~
In file included from ../libcperciva/alg/sha256_arm.c:12:
/usr/lib/gcc/aarch64-unknown-linux-gnu/10.2.0/include/arm_neon.h:26632:1: error: inlining failed in call to ‘always_inline’ ‘vsha256su0q_u32’: target specific option mismatch
26632 | vsha256su0q_u32 (uint32x4_t __w0_3, uint32x4_t __w4_7)
      | ^~~~~~~~~~~~~~~
../libcperciva/alg/sha256_arm.c:49:7: note: called from here
   49 |  X0 = vsha256su1q_u32(vsha256su0q_u32(X0, X1), X2, X3)
      |       ^~~~~~~~~~~~~~~~~~~~~~~~~~~~~~~~~~~~~~~~~~~~~~~~
../libcperciva/alg/sha256_arm.c:93:3: note: in expansion of macro ‘MSG4’
   93 |   MSG4(Y[1], Y[2], Y[3], Y[0]);
      |   ^~~~
In file included from ../libcperciva/alg/sha256_arm.c:12:
/usr/lib/gcc/aarch64-unknown-linux-gnu/10.2.0/include/arm_neon.h:26639:1: error: inlining failed in call to ‘always_inline’ ‘vsha256su1q_u32’: target specific option mismatch
26639 | vsha256su1q_u32 (uint32x4_t __tw0_3, uint32x4_t __w8_11, uint32x4_t __w12_15)
      | ^~~~~~~~~~~~~~~
../libcperciva/alg/sha256_arm.c:49:7: note: called from here
   49 |  X0 = vsha256su1q_u32(vsha256su0q_u32(X0, X1), X2, X3)
      |       ^~~~~~~~~~~~~~~~~~~~~~~~~~~~~~~~~~~~~~~~~~~~~~~~
../libcperciva/alg/sha256_arm.c:92:3: note: in expansion of macro ‘MSG4’
   92 |   MSG4(Y[0], Y[1], Y[2], Y[3]);
      |   ^~~~
In file included from ../libcperciva/alg/sha256_arm.c:12:
/usr/lib/gcc/aarch64-unknown-linux-gnu/10.2.0/include/arm_neon.h:26632:1: error: inlining failed in call to ‘always_inline’ ‘vsha256su0q_u32’: target specific option mismatch
26632 | vsha256su0q_u32 (uint32x4_t __w0_3, uint32x4_t __w4_7)
      | ^~~~~~~~~~~~~~~
../libcperciva/alg/sha256_arm.c:49:7: note: called from here
   49 |  X0 = vsha256su1q_u32(vsha256su0q_u32(X0, X1), X2, X3)
      |       ^~~~~~~~~~~~~~~~~~~~~~~~~~~~~~~~~~~~~~~~~~~~~~~~
../libcperciva/alg/sha256_arm.c:92:3: note: in expansion of macro ‘MSG4’
   92 |   MSG4(Y[0], Y[1], Y[2], Y[3]);
      |   ^~~~
make[2]: *** [Makefile:27: sha256_arm.o] Error 1
make[2]: Leaving directory '/build/spiped/src/spiped-1.6.1.99/liball'
make[1]: *** [Makefile:10: all] Error 2
make[1]: Leaving directory '/build/spiped/src/spiped-1.6.1.99/liball'
make: *** [Makefile:46: liball] Error 2
==> ERROR: A failure occurred in build().
    Aborting...
==> ERROR: Build failed, check /chroot/armv8/build/build