==> Synchronizing chroot copy [/chroot/i686/root] -> [build]...done
==> Making package: slb 0.1.24-5 (Mon Mar  4 21:12:32 2019)
==> Retrieving sources...
  -> Found slb-0.1.24.tar.gz
  -> Found slbm.service
  -> Found slbc.service
  -> Found slbcd.conf.sample
  -> Found configure.patch
==> Validating source files with sha512sums...
    slb-0.1.24.tar.gz ... Passed
    slbm.service ... Passed
    slbc.service ... Passed
    slbcd.conf.sample ... Passed
    configure.patch ... Passed
Host and machine ids are equal (03ca1e0d79db47a597e66a5149387887): refusing to link journals
==> Making package: slb 0.1.24-5 (Mon 04 Mar 2019 09:12:33 PM EST)
==> Checking runtime dependencies...
==> Installing missing dependencies...
resolving dependencies...
looking for conflicting packages...

Packages (3) libnl1-1.1.4-2.1  conn-1.0.39-1  ipvsadm-1.29-2.0

Total Download Size:   0.18 MiB
Total Installed Size:  0.69 MiB

:: Proceed with installation? [Y/n] 
:: Retrieving packages...
downloading libnl1-1.1.4-2.1-i686.pkg.tar.xz...
downloading ipvsadm-1.29-2.0-i686.pkg.tar.xz...
downloading conn-1.0.39-1-i686.pkg.tar.xz...
checking keyring...
checking package integrity...
loading package files...
checking for file conflicts...
checking available disk space...
:: Processing package changes...
installing libnl1...
installing ipvsadm...
installing conn...
:: Running post-transaction hooks...
(1/2) Reloading system manager configuration...
  Skipped: Current root is not booted.
(2/2) Arming ConditionNeedsUpdate...
==> Checking buildtime dependencies...
==> Retrieving sources...
  -> Found slb-0.1.24.tar.gz
  -> Found slbm.service
  -> Found slbc.service
  -> Found slbcd.conf.sample
  -> Found configure.patch
==> WARNING: Skipping all source file integrity checks.
==> Extracting sources...
  -> Extracting slb-0.1.24.tar.gz with bsdtar
==> Starting prepare()...
patching file duilder
patching file Makefile.in
patching file src/slbmd.c
==> Starting build()...

Duilder builder script
Copyright Catalin(ux) M. BOIE

PRJ=slb, VER=0.1.24, REV=1
System: Linux build 4.18.16-arch1-1-ARCH #1 SMP PREEMPT Sat Oct 20 22:06:45 UTC 2018 x86_64 GNU/Linux
Searching for PostgreSQL... not found.
Searching for MySQL... not found.
Searching for poll... found.
Searching for epoll... found.
Searching for ncurses... found.
Building Makefile...
Generate .spec file...
Generating config.h file...
Done. Run make.
==> Entering fakeroot environment...
==> Starting package()...
make[1]: Entering directory '/build/slb/src/slb-0.1.24/src'
cc -march=i686 -mtune=generic -O2 -pipe -fstack-protector-strong --param=ssp-buffer-size=4 -ggdb3 -Wall -Wextra -pedantic -Wno-long-long -pipe -I. -I.. slb_common.c -c
cc -march=i686 -mtune=generic -O2 -pipe -fstack-protector-strong --param=ssp-buffer-size=4 -ggdb3 -Wall -Wextra -pedantic -Wno-long-long -pipe -I. -I.. slbcd.c -o slbcd -lConn slb_common.o
slbcd.c: In function ‘lbd_get_port’:
slbcd.c:48:27: warning: ISO C does not support ‘__FUNCTION__’ predefined identifier [-Wpedantic]
  Log(3, "%s: cmd=[%s]\n", __FUNCTION__, dump);
                           ^~~~~~~~~~~~
slbcd.c: In function ‘s_accept’:
slbcd.c:98:3: warning: ISO C does not support ‘__FUNCTION__’ predefined identifier [-Wpedantic]
   __FUNCTION__, Conn_addr_remote(C), Conn_port_remote(C));
   ^~~~~~~~~~~~
slbcd.c: In function ‘s_close’:
slbcd.c:104:3: warning: ISO C does not support ‘__FUNCTION__’ predefined identifier [-Wpedantic]
   __FUNCTION__, Conn_addr_remote(C), Conn_port_remote(C));
   ^~~~~~~~~~~~
slbcd.c: In function ‘s_data_cb’:
slbcd.c:121:4: warning: ISO C does not support ‘__FUNCTION__’ predefined identifier [-Wpedantic]
    __FUNCTION__, dump);
    ^~~~~~~~~~~~
slbcd.c:134:14: warning: passing argument 1 of ‘Conn_debug’ makes integer from pointer without a cast [-Wint-conversion]
   Conn_debug(Logf, val);
              ^~~~
In file included from ./slb_common.h:28,
                 from slbcd.c:1:
/usr/include/Conn.h:47:22: note: expected ‘int’ but argument is of type ‘FILE *’ {aka ‘struct _IO_FILE *’}
 void  Conn_debug(int fd, const unsigned short debug);
                  ~~~~^~
slbcd.c:138:14: warning: passing argument 1 of ‘Conn_debug’ makes integer from pointer without a cast [-Wint-conversion]
   Conn_debug(Logf, val);
              ^~~~
In file included from ./slb_common.h:28,
                 from slbcd.c:1:
/usr/include/Conn.h:47:22: note: expected ‘int’ but argument is of type ‘FILE *’ {aka ‘struct _IO_FILE *’}
 void  Conn_debug(int fd, const unsigned short debug);
                  ~~~~^~
slbcd.c: In function ‘s_data’:
slbcd.c:163:25: warning: passing argument 2 of ‘Conn_for_every_line’ from incompatible pointer type [-Wincompatible-pointer-types]
  Conn_for_every_line(C, s_data_cb);
                         ^~~~~~~~~
In file included from ./slb_common.h:28,
                 from slbcd.c:1:
/usr/include/Conn.h:96:12: note: expected ‘void (*)(struct Conn *, char *)’ but argument is of type ‘int (*)(struct Conn *, char *)’
     void (*cb)(struct Conn *C, char *line));
     ~~~~~~~^~~~~~~~~~~~~~~~~~~~~~~~~~~~~~~
slbcd.c: In function ‘s_error’:
slbcd.c:169:3: warning: ISO C does not support ‘__FUNCTION__’ predefined identifier [-Wpedantic]
   __FUNCTION__, Conn_getid(C), Conn_errno(C));
   ^~~~~~~~~~~~
slbcd.c: In function ‘main’:
slbcd.c:230:13: warning: passing argument 1 of ‘Conn_debug’ makes integer from pointer without a cast [-Wint-conversion]
  Conn_debug(Logf, debug);
             ^~~~
In file included from ./slb_common.h:28,
                 from slbcd.c:1:
/usr/include/Conn.h:47:22: note: expected ‘int’ but argument is of type ‘FILE *’ {aka ‘struct _IO_FILE *’}
 void  Conn_debug(int fd, const unsigned short debug);
                  ~~~~^~
slbcd.c:263:2: error: ‘Conn_accept_cb’ undeclared (first use in this function); did you mean ‘Conn_set_cb’?
  Conn_accept_cb = s_accept;
  ^~~~~~~~~~~~~~
  Conn_set_cb
slbcd.c:263:2: note: each undeclared identifier is reported only once for each function it appears in
slbcd.c:264:2: error: ‘Conn_data_cb’ undeclared (first use in this function); did you mean ‘Conn_set_cb’?
  Conn_data_cb = s_data;
  ^~~~~~~~~~~~
  Conn_set_cb
slbcd.c:265:2: error: ‘Conn_close_cb’ undeclared (first use in this function); did you mean ‘Conn_close’?
  Conn_close_cb = s_close;
  ^~~~~~~~~~~~~
  Conn_close
slbcd.c:266:2: error: ‘Conn_error_cb’ undeclared (first use in this function); did you mean ‘Conn_set_cb’?
  Conn_error_cb = s_error;
  ^~~~~~~~~~~~~
  Conn_set_cb
make[1]: *** [Makefile:11: slbcd] Error 1
make[1]: Leaving directory '/build/slb/src/slb-0.1.24/src'
make: *** [Makefile:41: src] Error 2
==> ERROR: A failure occurred in package().
    Aborting...
==> Removing installed dependencies...
checking dependencies...

Packages (3) conn-1.0.39-1  ipvsadm-1.29-2.0  libnl1-1.1.4-2.1

Total Removed Size:  0.69 MiB

:: Do you want to remove these packages? [Y/n] 
:: Processing package changes...
removing ipvsadm...
removing libnl1...
removing conn...
:: Running post-transaction hooks...
(1/2) Reloading system manager configuration...
  Skipped: Current root is not booted.
(2/2) Arming ConditionNeedsUpdate...
==> ERROR: Build failed, check /chroot/i686/build/build