==> Synchronizing chroot copy [/chroot/x86_64/root] -> [build]...done
==> Making package: skipfish 2.10b-3 (Mon Mar  4 21:35:02 2019)
==> Retrieving sources...
  -> Found skipfish-2.10b.tgz
  -> Found skipfish.patch
==> Validating source files with sha512sums...
    skipfish-2.10b.tgz ... Passed
    skipfish.patch ... Passed
Host and machine ids are equal (03ca1e0d79db47a597e66a5149387887): refusing to link journals
==> Making package: skipfish 2.10b-3 (Mon 04 Mar 2019 09:35:03 PM EST)
==> Checking runtime dependencies...
==> Installing missing dependencies...
resolving dependencies...
looking for conflicting packages...

Packages (1) libidn-1.35-1

Total Installed Size:  0.67 MiB

:: Proceed with installation? [Y/n] 
checking keyring...
checking package integrity...
loading package files...
checking for file conflicts...
checking available disk space...
:: Processing package changes...
installing libidn...
:: Running post-transaction hooks...
(1/2) Arming ConditionNeedsUpdate...
(2/2) Updating the info directory file...
==> Checking buildtime dependencies...
==> Retrieving sources...
  -> Found skipfish-2.10b.tgz
  -> Found skipfish.patch
==> WARNING: Skipping all source file integrity checks.
==> Extracting sources...
  -> Extracting skipfish-2.10b.tgz with bsdtar
==> Starting build()...
File src/config.h is read-only; trying to patch anyway
patching file src/config.h
Hunk #1 succeeded at 29 (offset -6 lines).
File signatures/signatures.conf is read-only; trying to patch anyway
patching file signatures/signatures.conf
cc -Wl,-O1,--sort-common,--as-needed,-z,relro -L/usr/local/lib/ -L/opt/local/lib src/skipfish.c -o skipfish \
        -O3 -Wno-format -Wall -funsigned-char -g -ggdb -I/usr/local/include/ -I/opt/local/include/ -march=x86-64 -mtune=generic -O2 -pipe -fstack-protector-strong --param=ssp-buffer-size=4 -DVERSION=\"2.10b\" src/http_client.c src/database.c src/crawler.c src/analysis.c src/report.c src/checks.c src/signatures.c src/auth.c src/options.c -lcrypto -lssl -lidn -lz -lpcre
src/http_client.c: In function ‘check_ssl’:
src/http_client.c:1965:10: error: dereferencing pointer to incomplete type ‘SSL_CIPHER’ {aka ‘const struct ssl_cipher_st’}
   if(!(cp->algo_strength & SSL_MEDIUM) && !(cp->algo_strength & SSL_HIGH))
          ^~
src/http_client.c:1982:34: error: dereferencing pointer to incomplete type ‘X509’ {aka ‘struct x509_st’}
     if (ASN1_UTCTIME_cmp_time_t(p->cert_info->validity->notBefore, cur_time)
                                  ^~
src/http_client.c:2027:11: warning: ‘ASN1_STRING_data’ is deprecated [-Wdeprecated-declarations]
           buf = (char*)ASN1_STRING_data(name->d.dNSName);
           ^~~
In file included from /usr/include/openssl/e_os2.h:13,
                 from /usr/include/openssl/ssl.h:15,
                 from src/http_client.c:37:
/usr/include/openssl/asn1.h:554:1: note: declared here
 DEPRECATEDIN_1_1_0(unsigned char *ASN1_STRING_data(ASN1_STRING *x))
 ^~~~~~~~~~~~~~~~~~
src/report.c: In function ‘collect_samples’:
src/report.c:447:5: warning: this ‘for’ clause does not guard... [-Wmisleading-indentation]
     for (i=0;i<m_samp_cnt;i++)
     ^~~
src/report.c:450:7: note: ...this statement, but the latter is misleadingly indented as if it were guarded by the ‘for’
       if (i == m_samp_cnt) {
       ^~
make: *** [Makefile:48: skipfish] Error 1
==> ERROR: A failure occurred in build().
    Aborting...
==> Removing installed dependencies...
checking dependencies...

Packages (1) libidn-1.35-1

Total Removed Size:  0.67 MiB

:: Do you want to remove these packages? [Y/n] 
:: Running pre-transaction hooks...
(1/1) Removing old entries from the info directory file...
:: Processing package changes...
removing libidn...
:: Running post-transaction hooks...
(1/1) Arming ConditionNeedsUpdate...
==> ERROR: Build failed, check /chroot/x86_64/build/build