==> Creating clean working copy [build]...done
==> Making package: rr 4.5.0-2 (Mon Jun  5 12:36:16 EDT 2017)
==> Retrieving sources...
  -> Found 4.5.0.tar.gz
==> Validating source files with sha512sums...
    4.5.0.tar.gz ... Passed
==> Making package: rr 4.5.0-2 (Mon Jun  5 12:36:16 EDT 2017)
==> Checking runtime dependencies...
==> Installing missing dependencies...
resolving dependencies...
looking for conflicting packages...

Packages (3) lib32-zlib-1.2.11-1  libpfm4-4.7.0-2  python2-2.7.13-2

Total Download Size:    0.21 MiB
Total Installed Size:  72.61 MiB

:: Proceed with installation? [Y/n] 
:: Retrieving packages...
downloading libpfm4-4.7.0-2-x86_64.pkg.tar.xz...
downloading libpfm4-4.7.0-2-x86_64.pkg.tar.xz...
downloading libpfm4-4.7.0-2-x86_64.pkg.tar.xz...
downloading libpfm4-4.7.0-2-x86_64.pkg.tar.xz...
downloading libpfm4-4.7.0-2-x86_64.pkg.tar.xz...
checking keyring...
checking package integrity...
loading package files...
checking for file conflicts...
checking available disk space...
:: Processing package changes...
installing libpfm4...
installing lib32-zlib...
installing python2...
Optional dependencies for python2
    tk: for IDLE
    python2-setuptools
    python2-pip
==> Checking buildtime dependencies...
==> Installing missing dependencies...
resolving dependencies...
looking for conflicting packages...

Packages (11) gdb-common-7.12.1-3  guile2.0-2.0.14-1  jsoncpp-1.8.0-1  libuv-1.12.0-1  libxml2-2.9.4+16+g07418011-2  python-3.6.1-1  python2-ptyprocess-0.5.1-2  shared-mime-info-1.8-1  cmake-3.8.1-1  gdb-7.12.1-3  python2-pexpect-4.2.1-2

Total Download Size:    46.06 MiB
Total Installed Size:  190.42 MiB

:: Proceed with installation? [Y/n] 
:: Retrieving packages...
downloading libxml2-2.9.4+16+g07418011-2-x86_64.pkg.tar.xz...
downloading shared-mime-info-1.8-1-x86_64.pkg.tar.xz...
downloading jsoncpp-1.8.0-1-x86_64.pkg.tar.xz...
downloading libuv-1.12.0-1-x86_64.pkg.tar.xz...
downloading cmake-3.8.1-1-x86_64.pkg.tar.xz...
downloading python-3.6.1-1-x86_64.pkg.tar.xz...
downloading guile2.0-2.0.14-1-x86_64.pkg.tar.xz...
downloading gdb-common-7.12.1-3-x86_64.pkg.tar.xz...
downloading gdb-7.12.1-3-x86_64.pkg.tar.xz...
downloading python2-ptyprocess-0.5.1-2-any.pkg.tar.xz...
downloading python2-pexpect-4.2.1-2-any.pkg.tar.xz...
checking keyring...
checking package integrity...
loading package files...
checking for file conflicts...
checking available disk space...
:: Processing package changes...
installing libxml2...
installing shared-mime-info...
installing jsoncpp...
Optional dependencies for jsoncpp
    jsoncpp-doc: documentation
installing libuv...
installing cmake...
Optional dependencies for cmake
    qt5-base: cmake-gui
    libxkbcommon-x11: cmake-gui
installing python2-ptyprocess...
installing python2-pexpect...
installing python...
Optional dependencies for python
    python-setuptools
    python-pip
    sqlite [installed]
    mpdecimal: for decimal
    xz: for lzma [installed]
    tk: for tkinter
installing guile2.0...
installing gdb-common...
installing gdb...
:: Running post-transaction hooks...
(1/2) Updating the info directory file...
(2/2) Updating the MIME type database...
==> Retrieving sources...
  -> Found 4.5.0.tar.gz
==> WARNING: Skipping verification of source file PGP signatures.
==> Validating source files with sha512sums...
    4.5.0.tar.gz ... Passed
==> Extracting sources...
  -> Extracting 4.5.0.tar.gz with bsdtar
==> Starting build()...
-- The C compiler identification is GNU 7.1.1
-- The CXX compiler identification is GNU 7.1.1
-- The ASM compiler identification is GNU
-- Found assembler: /usr/bin/cc
-- Check for working C compiler: /usr/bin/cc
-- Check for working C compiler: /usr/bin/cc -- works
-- Detecting C compiler ABI info
-- Detecting C compiler ABI info - done
-- Detecting C compile features
-- Detecting C compile features - done
-- Check for working CXX compiler: /usr/bin/c++
-- Check for working CXX compiler: /usr/bin/c++ -- works
-- Detecting CXX compiler ABI info
-- Detecting CXX compiler ABI info - done
-- Detecting CXX compile features
-- Detecting CXX compile features - done
-- Found PkgConfig: /usr/bin/pkg-config (found version "0.29.2") 
-- Checking for module 'zlib'
--   Found zlib, version 1.2.11
-- Found PythonInterp: /usr/bin/python2 (found suitable version "2.7.13", minimum required is "2.7") 
-- Configuring done
-- Generating done
-- Build files have been written to: /build/rr/src/rr-4.5.0/build
/usr/bin/cmake -H/build/rr/src/rr-4.5.0 -B/build/rr/src/rr-4.5.0/build --check-build-system CMakeFiles/Makefile.cmake 0
/usr/bin/cmake -E cmake_progress_start /build/rr/src/rr-4.5.0/build/CMakeFiles /build/rr/src/rr-4.5.0/build/CMakeFiles/progress.marks
make -f CMakeFiles/Makefile2 all
make[1]: Entering directory '/build/rr/src/rr-4.5.0/build'
make -f CMakeFiles/ftrace_helper.dir/build.make CMakeFiles/ftrace_helper.dir/depend
make[2]: Entering directory '/build/rr/src/rr-4.5.0/build'
cd /build/rr/src/rr-4.5.0/build && /usr/bin/cmake -E cmake_depends "Unix Makefiles" /build/rr/src/rr-4.5.0 /build/rr/src/rr-4.5.0 /build/rr/src/rr-4.5.0/build /build/rr/src/rr-4.5.0/build /build/rr/src/rr-4.5.0/build/CMakeFiles/ftrace_helper.dir/DependInfo.cmake --color=
Scanning dependencies of target ftrace_helper
make[2]: Leaving directory '/build/rr/src/rr-4.5.0/build'
make -f CMakeFiles/ftrace_helper.dir/build.make CMakeFiles/ftrace_helper.dir/build
make[2]: Entering directory '/build/rr/src/rr-4.5.0/build'
[  0%] Building C object CMakeFiles/ftrace_helper.dir/src/ftrace/ftrace_helper.c.o
/usr/bin/cc -DRR_VERSION=\"4.5.0\" -I/build/rr/src/rr-4.5.0/include -I/build/rr/src/rr-4.5.0/third-party/proc-service -I/build/rr/src/rr-4.5.0/build  -march=x86-64 -mtune=generic -O2 -pipe -fstack-protector-strong --param=ssp-buffer-size=4 -fPIC -pthread -g3 -Wall -Wextra -Wstrict-prototypes -std=gnu11   -O2   -o CMakeFiles/ftrace_helper.dir/src/ftrace/ftrace_helper.c.o   -c /build/rr/src/rr-4.5.0/src/ftrace/ftrace_helper.c
[  0%] Linking C executable bin/ftrace_helper
/usr/bin/cmake -E cmake_link_script CMakeFiles/ftrace_helper.dir/link.txt --verbose=1
/usr/bin/cc -march=x86-64 -mtune=generic -O2 -pipe -fstack-protector-strong --param=ssp-buffer-size=4 -fPIC -pthread -g3 -Wall -Wextra -Wstrict-prototypes -std=gnu11   -O2  -Wl,-O1,--sort-common,--as-needed,-z,relro -rdynamic CMakeFiles/ftrace_helper.dir/src/ftrace/ftrace_helper.c.o  -o bin/ftrace_helper 
make[2]: Leaving directory '/build/rr/src/rr-4.5.0/build'
[  0%] Built target ftrace_helper
make -f CMakeFiles/core_count.dir/build.make CMakeFiles/core_count.dir/depend
make[2]: Entering directory '/build/rr/src/rr-4.5.0/build'
cd /build/rr/src/rr-4.5.0/build && /usr/bin/cmake -E cmake_depends "Unix Makefiles" /build/rr/src/rr-4.5.0 /build/rr/src/rr-4.5.0 /build/rr/src/rr-4.5.0/build /build/rr/src/rr-4.5.0/build /build/rr/src/rr-4.5.0/build/CMakeFiles/core_count.dir/DependInfo.cmake --color=
Scanning dependencies of target core_count
make[2]: Leaving directory '/build/rr/src/rr-4.5.0/build'
make -f CMakeFiles/core_count.dir/build.make CMakeFiles/core_count.dir/build
make[2]: Entering directory '/build/rr/src/rr-4.5.0/build'
[  0%] Building C object CMakeFiles/core_count.dir/src/chaos-test/core_count.c.o
/usr/bin/cc -DRR_VERSION=\"4.5.0\" -I/build/rr/src/rr-4.5.0/include -I/build/rr/src/rr-4.5.0/third-party/proc-service -I/build/rr/src/rr-4.5.0/build  -march=x86-64 -mtune=generic -O2 -pipe -fstack-protector-strong --param=ssp-buffer-size=4 -fPIC -pthread -g3 -Wall -Wextra -Wstrict-prototypes -std=gnu11   -O2   -o CMakeFiles/core_count.dir/src/chaos-test/core_count.c.o   -c /build/rr/src/rr-4.5.0/src/chaos-test/core_count.c
[  0%] Linking C executable bin/core_count
/usr/bin/cmake -E cmake_link_script CMakeFiles/core_count.dir/link.txt --verbose=1
/usr/bin/cc -march=x86-64 -mtune=generic -O2 -pipe -fstack-protector-strong --param=ssp-buffer-size=4 -fPIC -pthread -g3 -Wall -Wextra -Wstrict-prototypes -std=gnu11   -O2  -Wl,-O1,--sort-common,--as-needed,-z,relro -rdynamic CMakeFiles/core_count.dir/src/chaos-test/core_count.c.o  -o bin/core_count -lrt 
make[2]: Leaving directory '/build/rr/src/rr-4.5.0/build'
[  0%] Built target core_count
make -f CMakeFiles/Generated.dir/build.make CMakeFiles/Generated.dir/depend
make[2]: Entering directory '/build/rr/src/rr-4.5.0/build'
cd /build/rr/src/rr-4.5.0/build && /usr/bin/cmake -E cmake_depends "Unix Makefiles" /build/rr/src/rr-4.5.0 /build/rr/src/rr-4.5.0 /build/rr/src/rr-4.5.0/build /build/rr/src/rr-4.5.0/build /build/rr/src/rr-4.5.0/build/CMakeFiles/Generated.dir/DependInfo.cmake --color=
Scanning dependencies of target Generated
make[2]: Leaving directory '/build/rr/src/rr-4.5.0/build'
make -f CMakeFiles/Generated.dir/build.make CMakeFiles/Generated.dir/build
make[2]: Entering directory '/build/rr/src/rr-4.5.0/build'
[  0%] Generating AssemblyTemplates.generated
../src/generate_syscalls.py /build/rr/src/rr-4.5.0/build/AssemblyTemplates.generated
[  0%] Generating CheckSyscallNumbers.generated
../src/generate_syscalls.py /build/rr/src/rr-4.5.0/build/CheckSyscallNumbers.generated
[  0%] Generating SyscallEnumsX64.generated
../src/generate_syscalls.py /build/rr/src/rr-4.5.0/build/SyscallEnumsX64.generated
[  0%] Generating SyscallEnumsX86.generated
../src/generate_syscalls.py /build/rr/src/rr-4.5.0/build/SyscallEnumsX86.generated
[  0%] Generating SyscallEnumsForTestsX64.generated
../src/generate_syscalls.py /build/rr/src/rr-4.5.0/build/SyscallEnumsForTestsX64.generated
[  0%] Generating SyscallEnumsForTestsX86.generated
../src/generate_syscalls.py /build/rr/src/rr-4.5.0/build/SyscallEnumsForTestsX86.generated
[  0%] Generating SyscallHelperFunctions.generated
../src/generate_syscalls.py /build/rr/src/rr-4.5.0/build/SyscallHelperFunctions.generated
[  0%] Generating SyscallnameArch.generated
../src/generate_syscalls.py /build/rr/src/rr-4.5.0/build/SyscallnameArch.generated
[  0%] Generating SyscallRecordCase.generated
../src/generate_syscalls.py /build/rr/src/rr-4.5.0/build/SyscallRecordCase.generated
make[2]: Leaving directory '/build/rr/src/rr-4.5.0/build'
[  0%] Built target Generated
make -f CMakeFiles/watchpoint_unaligned_32.dir/build.make CMakeFiles/watchpoint_unaligned_32.dir/depend
make[2]: Entering directory '/build/rr/src/rr-4.5.0/build'
cd /build/rr/src/rr-4.5.0/build && /usr/bin/cmake -E cmake_depends "Unix Makefiles" /build/rr/src/rr-4.5.0 /build/rr/src/rr-4.5.0 /build/rr/src/rr-4.5.0/build /build/rr/src/rr-4.5.0/build /build/rr/src/rr-4.5.0/build/CMakeFiles/watchpoint_unaligned_32.dir/DependInfo.cmake --color=
Scanning dependencies of target watchpoint_unaligned_32
make[2]: Leaving directory '/build/rr/src/rr-4.5.0/build'
make -f CMakeFiles/watchpoint_unaligned_32.dir/build.make CMakeFiles/watchpoint_unaligned_32.dir/build
make[2]: Entering directory '/build/rr/src/rr-4.5.0/build'
[  1%] Building C object CMakeFiles/watchpoint_unaligned_32.dir/32/watchpoint_unaligned.c.o
/usr/bin/cc -DRR_VERSION=\"4.5.0\" -I/build/rr/src/rr-4.5.0/include -I/build/rr/src/rr-4.5.0/third-party/proc-service -I/build/rr/src/rr-4.5.0/build  -march=x86-64 -mtune=generic -O2 -pipe -fstack-protector-strong --param=ssp-buffer-size=4 -fPIC -pthread -g3 -Wall -Wextra -Wstrict-prototypes -std=gnu11   -O2   -m32 -O0 -Werror -DDEBUG -o CMakeFiles/watchpoint_unaligned_32.dir/32/watchpoint_unaligned.c.o   -c /build/rr/src/rr-4.5.0/build/32/watchpoint_unaligned.c
[  1%] Linking C executable bin/watchpoint_unaligned_32
/usr/bin/cmake -E cmake_link_script CMakeFiles/watchpoint_unaligned_32.dir/link.txt --verbose=1
/usr/bin/cc -march=x86-64 -mtune=generic -O2 -pipe -fstack-protector-strong --param=ssp-buffer-size=4 -fPIC -pthread -g3 -Wall -Wextra -Wstrict-prototypes -std=gnu11   -O2  -Wl,-O1,--sort-common,--as-needed,-z,relro -rdynamic -m32 -O0 -Werror -DDEBUG CMakeFiles/watchpoint_unaligned_32.dir/32/watchpoint_unaligned.c.o  -o bin/watchpoint_unaligned_32 -lrt -ldl 
make[2]: Leaving directory '/build/rr/src/rr-4.5.0/build'
[  1%] Built target watchpoint_unaligned_32
make -f CMakeFiles/watchpoint_before_signal_32.dir/build.make CMakeFiles/watchpoint_before_signal_32.dir/depend
make[2]: Entering directory '/build/rr/src/rr-4.5.0/build'
cd /build/rr/src/rr-4.5.0/build && /usr/bin/cmake -E cmake_depends "Unix Makefiles" /build/rr/src/rr-4.5.0 /build/rr/src/rr-4.5.0 /build/rr/src/rr-4.5.0/build /build/rr/src/rr-4.5.0/build /build/rr/src/rr-4.5.0/build/CMakeFiles/watchpoint_before_signal_32.dir/DependInfo.cmake --color=
Scanning dependencies of target watchpoint_before_signal_32
make[2]: Leaving directory '/build/rr/src/rr-4.5.0/build'
make -f CMakeFiles/watchpoint_before_signal_32.dir/build.make CMakeFiles/watchpoint_before_signal_32.dir/build
make[2]: Entering directory '/build/rr/src/rr-4.5.0/build'
[  1%] Building C object CMakeFiles/watchpoint_before_signal_32.dir/32/watchpoint_before_signal.c.o
/usr/bin/cc -DRR_VERSION=\"4.5.0\" -I/build/rr/src/rr-4.5.0/include -I/build/rr/src/rr-4.5.0/third-party/proc-service -I/build/rr/src/rr-4.5.0/build  -march=x86-64 -mtune=generic -O2 -pipe -fstack-protector-strong --param=ssp-buffer-size=4 -fPIC -pthread -g3 -Wall -Wextra -Wstrict-prototypes -std=gnu11   -O2   -m32 -O0 -Werror -DDEBUG -o CMakeFiles/watchpoint_before_signal_32.dir/32/watchpoint_before_signal.c.o   -c /build/rr/src/rr-4.5.0/build/32/watchpoint_before_signal.c
[  1%] Linking C executable bin/watchpoint_before_signal_32
/usr/bin/cmake -E cmake_link_script CMakeFiles/watchpoint_before_signal_32.dir/link.txt --verbose=1
/usr/bin/cc -march=x86-64 -mtune=generic -O2 -pipe -fstack-protector-strong --param=ssp-buffer-size=4 -fPIC -pthread -g3 -Wall -Wextra -Wstrict-prototypes -std=gnu11   -O2  -Wl,-O1,--sort-common,--as-needed,-z,relro -rdynamic -m32 -O0 -Werror -DDEBUG CMakeFiles/watchpoint_before_signal_32.dir/32/watchpoint_before_signal.c.o  -o bin/watchpoint_before_signal_32 -lrt -ldl 
make[2]: Leaving directory '/build/rr/src/rr-4.5.0/build'
[  1%] Built target watchpoint_before_signal_32
make -f CMakeFiles/watchpoint_at_sched_32.dir/build.make CMakeFiles/watchpoint_at_sched_32.dir/depend
make[2]: Entering directory '/build/rr/src/rr-4.5.0/build'
cd /build/rr/src/rr-4.5.0/build && /usr/bin/cmake -E cmake_depends "Unix Makefiles" /build/rr/src/rr-4.5.0 /build/rr/src/rr-4.5.0 /build/rr/src/rr-4.5.0/build /build/rr/src/rr-4.5.0/build /build/rr/src/rr-4.5.0/build/CMakeFiles/watchpoint_at_sched_32.dir/DependInfo.cmake --color=
Scanning dependencies of target watchpoint_at_sched_32
make[2]: Leaving directory '/build/rr/src/rr-4.5.0/build'
make -f CMakeFiles/watchpoint_at_sched_32.dir/build.make CMakeFiles/watchpoint_at_sched_32.dir/build
make[2]: Entering directory '/build/rr/src/rr-4.5.0/build'
[  1%] Building C object CMakeFiles/watchpoint_at_sched_32.dir/32/watchpoint_at_sched.c.o
/usr/bin/cc -DRR_VERSION=\"4.5.0\" -I/build/rr/src/rr-4.5.0/include -I/build/rr/src/rr-4.5.0/third-party/proc-service -I/build/rr/src/rr-4.5.0/build  -march=x86-64 -mtune=generic -O2 -pipe -fstack-protector-strong --param=ssp-buffer-size=4 -fPIC -pthread -g3 -Wall -Wextra -Wstrict-prototypes -std=gnu11   -O2   -m32 -O0 -Werror -DDEBUG -o CMakeFiles/watchpoint_at_sched_32.dir/32/watchpoint_at_sched.c.o   -c /build/rr/src/rr-4.5.0/build/32/watchpoint_at_sched.c
[  1%] Linking C executable bin/watchpoint_at_sched_32
/usr/bin/cmake -E cmake_link_script CMakeFiles/watchpoint_at_sched_32.dir/link.txt --verbose=1
/usr/bin/cc -march=x86-64 -mtune=generic -O2 -pipe -fstack-protector-strong --param=ssp-buffer-size=4 -fPIC -pthread -g3 -Wall -Wextra -Wstrict-prototypes -std=gnu11   -O2  -Wl,-O1,--sort-common,--as-needed,-z,relro -rdynamic -m32 -O0 -Werror -DDEBUG CMakeFiles/watchpoint_at_sched_32.dir/32/watchpoint_at_sched.c.o  -o bin/watchpoint_at_sched_32 -lrt -ldl 
make[2]: Leaving directory '/build/rr/src/rr-4.5.0/build'
[  1%] Built target watchpoint_at_sched_32
make -f CMakeFiles/watchpoint_32.dir/build.make CMakeFiles/watchpoint_32.dir/depend
make[2]: Entering directory '/build/rr/src/rr-4.5.0/build'
cd /build/rr/src/rr-4.5.0/build && /usr/bin/cmake -E cmake_depends "Unix Makefiles" /build/rr/src/rr-4.5.0 /build/rr/src/rr-4.5.0 /build/rr/src/rr-4.5.0/build /build/rr/src/rr-4.5.0/build /build/rr/src/rr-4.5.0/build/CMakeFiles/watchpoint_32.dir/DependInfo.cmake --color=
Scanning dependencies of target watchpoint_32
make[2]: Leaving directory '/build/rr/src/rr-4.5.0/build'
make -f CMakeFiles/watchpoint_32.dir/build.make CMakeFiles/watchpoint_32.dir/build
make[2]: Entering directory '/build/rr/src/rr-4.5.0/build'
[  1%] Building C object CMakeFiles/watchpoint_32.dir/32/watchpoint.c.o
/usr/bin/cc -DRR_VERSION=\"4.5.0\" -I/build/rr/src/rr-4.5.0/include -I/build/rr/src/rr-4.5.0/third-party/proc-service -I/build/rr/src/rr-4.5.0/build  -march=x86-64 -mtune=generic -O2 -pipe -fstack-protector-strong --param=ssp-buffer-size=4 -fPIC -pthread -g3 -Wall -Wextra -Wstrict-prototypes -std=gnu11   -O2   -m32 -O0 -Werror -DDEBUG -o CMakeFiles/watchpoint_32.dir/32/watchpoint.c.o   -c /build/rr/src/rr-4.5.0/build/32/watchpoint.c
[  1%] Linking C executable bin/watchpoint_32
/usr/bin/cmake -E cmake_link_script CMakeFiles/watchpoint_32.dir/link.txt --verbose=1
/usr/bin/cc -march=x86-64 -mtune=generic -O2 -pipe -fstack-protector-strong --param=ssp-buffer-size=4 -fPIC -pthread -g3 -Wall -Wextra -Wstrict-prototypes -std=gnu11   -O2  -Wl,-O1,--sort-common,--as-needed,-z,relro -rdynamic -m32 -O0 -Werror -DDEBUG CMakeFiles/watchpoint_32.dir/32/watchpoint.c.o  -o bin/watchpoint_32 -lrt -ldl 
make[2]: Leaving directory '/build/rr/src/rr-4.5.0/build'
[  1%] Built target watchpoint_32
make -f CMakeFiles/wait_for_all_32.dir/build.make CMakeFiles/wait_for_all_32.dir/depend
make[2]: Entering directory '/build/rr/src/rr-4.5.0/build'
cd /build/rr/src/rr-4.5.0/build && /usr/bin/cmake -E cmake_depends "Unix Makefiles" /build/rr/src/rr-4.5.0 /build/rr/src/rr-4.5.0 /build/rr/src/rr-4.5.0/build /build/rr/src/rr-4.5.0/build /build/rr/src/rr-4.5.0/build/CMakeFiles/wait_for_all_32.dir/DependInfo.cmake --color=
Scanning dependencies of target wait_for_all_32
make[2]: Leaving directory '/build/rr/src/rr-4.5.0/build'
make -f CMakeFiles/wait_for_all_32.dir/build.make CMakeFiles/wait_for_all_32.dir/build
make[2]: Entering directory '/build/rr/src/rr-4.5.0/build'
[  1%] Building C object CMakeFiles/wait_for_all_32.dir/32/wait_for_all.c.o
/usr/bin/cc -DRR_VERSION=\"4.5.0\" -I/build/rr/src/rr-4.5.0/include -I/build/rr/src/rr-4.5.0/third-party/proc-service -I/build/rr/src/rr-4.5.0/build  -march=x86-64 -mtune=generic -O2 -pipe -fstack-protector-strong --param=ssp-buffer-size=4 -fPIC -pthread -g3 -Wall -Wextra -Wstrict-prototypes -std=gnu11   -O2   -m32 -O0 -Werror -DDEBUG -o CMakeFiles/wait_for_all_32.dir/32/wait_for_all.c.o   -c /build/rr/src/rr-4.5.0/build/32/wait_for_all.c
[  1%] Linking C executable bin/wait_for_all_32
/usr/bin/cmake -E cmake_link_script CMakeFiles/wait_for_all_32.dir/link.txt --verbose=1
/usr/bin/cc -march=x86-64 -mtune=generic -O2 -pipe -fstack-protector-strong --param=ssp-buffer-size=4 -fPIC -pthread -g3 -Wall -Wextra -Wstrict-prototypes -std=gnu11   -O2  -Wl,-O1,--sort-common,--as-needed,-z,relro -rdynamic -m32 -O0 -Werror -DDEBUG CMakeFiles/wait_for_all_32.dir/32/wait_for_all.c.o  -o bin/wait_for_all_32 -lrt -ldl 
make[2]: Leaving directory '/build/rr/src/rr-4.5.0/build'
[  1%] Built target wait_for_all_32
make -f CMakeFiles/user_ignore_sig_32.dir/build.make CMakeFiles/user_ignore_sig_32.dir/depend
make[2]: Entering directory '/build/rr/src/rr-4.5.0/build'
cd /build/rr/src/rr-4.5.0/build && /usr/bin/cmake -E cmake_depends "Unix Makefiles" /build/rr/src/rr-4.5.0 /build/rr/src/rr-4.5.0 /build/rr/src/rr-4.5.0/build /build/rr/src/rr-4.5.0/build /build/rr/src/rr-4.5.0/build/CMakeFiles/user_ignore_sig_32.dir/DependInfo.cmake --color=
Scanning dependencies of target user_ignore_sig_32
make[2]: Leaving directory '/build/rr/src/rr-4.5.0/build'
make -f CMakeFiles/user_ignore_sig_32.dir/build.make CMakeFiles/user_ignore_sig_32.dir/build
make[2]: Entering directory '/build/rr/src/rr-4.5.0/build'
[  1%] Building C object CMakeFiles/user_ignore_sig_32.dir/32/user_ignore_sig.c.o
/usr/bin/cc -DRR_VERSION=\"4.5.0\" -I/build/rr/src/rr-4.5.0/include -I/build/rr/src/rr-4.5.0/third-party/proc-service -I/build/rr/src/rr-4.5.0/build  -march=x86-64 -mtune=generic -O2 -pipe -fstack-protector-strong --param=ssp-buffer-size=4 -fPIC -pthread -g3 -Wall -Wextra -Wstrict-prototypes -std=gnu11   -O2   -m32 -O0 -Werror -DDEBUG -o CMakeFiles/user_ignore_sig_32.dir/32/user_ignore_sig.c.o   -c /build/rr/src/rr-4.5.0/build/32/user_ignore_sig.c
[  1%] Linking C executable bin/user_ignore_sig_32
/usr/bin/cmake -E cmake_link_script CMakeFiles/user_ignore_sig_32.dir/link.txt --verbose=1
/usr/bin/cc -march=x86-64 -mtune=generic -O2 -pipe -fstack-protector-strong --param=ssp-buffer-size=4 -fPIC -pthread -g3 -Wall -Wextra -Wstrict-prototypes -std=gnu11   -O2  -Wl,-O1,--sort-common,--as-needed,-z,relro -rdynamic -m32 -O0 -Werror -DDEBUG CMakeFiles/user_ignore_sig_32.dir/32/user_ignore_sig.c.o  -o bin/user_ignore_sig_32 -lrt -ldl 
make[2]: Leaving directory '/build/rr/src/rr-4.5.0/build'
[  1%] Built target user_ignore_sig_32
make -f CMakeFiles/unexpected_stack_growth_32.dir/build.make CMakeFiles/unexpected_stack_growth_32.dir/depend
make[2]: Entering directory '/build/rr/src/rr-4.5.0/build'
cd /build/rr/src/rr-4.5.0/build && /usr/bin/cmake -E cmake_depends "Unix Makefiles" /build/rr/src/rr-4.5.0 /build/rr/src/rr-4.5.0 /build/rr/src/rr-4.5.0/build /build/rr/src/rr-4.5.0/build /build/rr/src/rr-4.5.0/build/CMakeFiles/unexpected_stack_growth_32.dir/DependInfo.cmake --color=
Scanning dependencies of target unexpected_stack_growth_32
make[2]: Leaving directory '/build/rr/src/rr-4.5.0/build'
make -f CMakeFiles/unexpected_stack_growth_32.dir/build.make CMakeFiles/unexpected_stack_growth_32.dir/build
make[2]: Entering directory '/build/rr/src/rr-4.5.0/build'
[  1%] Building C object CMakeFiles/unexpected_stack_growth_32.dir/32/unexpected_stack_growth.c.o
/usr/bin/cc -DRR_VERSION=\"4.5.0\" -I/build/rr/src/rr-4.5.0/include -I/build/rr/src/rr-4.5.0/third-party/proc-service -I/build/rr/src/rr-4.5.0/build  -march=x86-64 -mtune=generic -O2 -pipe -fstack-protector-strong --param=ssp-buffer-size=4 -fPIC -pthread -g3 -Wall -Wextra -Wstrict-prototypes -std=gnu11   -O2   -m32 -O0 -Werror -DDEBUG -o CMakeFiles/unexpected_stack_growth_32.dir/32/unexpected_stack_growth.c.o   -c /build/rr/src/rr-4.5.0/build/32/unexpected_stack_growth.c
[  1%] Linking C executable bin/unexpected_stack_growth_32
/usr/bin/cmake -E cmake_link_script CMakeFiles/unexpected_stack_growth_32.dir/link.txt --verbose=1
/usr/bin/cc -march=x86-64 -mtune=generic -O2 -pipe -fstack-protector-strong --param=ssp-buffer-size=4 -fPIC -pthread -g3 -Wall -Wextra -Wstrict-prototypes -std=gnu11   -O2  -Wl,-O1,--sort-common,--as-needed,-z,relro -rdynamic -m32 -O0 -Werror -DDEBUG CMakeFiles/unexpected_stack_growth_32.dir/32/unexpected_stack_growth.c.o  -o bin/unexpected_stack_growth_32 -lrt -ldl 
make[2]: Leaving directory '/build/rr/src/rr-4.5.0/build'
[  1%] Built target unexpected_stack_growth_32
make -f CMakeFiles/tls_32.dir/build.make CMakeFiles/tls_32.dir/depend
make[2]: Entering directory '/build/rr/src/rr-4.5.0/build'
cd /build/rr/src/rr-4.5.0/build && /usr/bin/cmake -E cmake_depends "Unix Makefiles" /build/rr/src/rr-4.5.0 /build/rr/src/rr-4.5.0 /build/rr/src/rr-4.5.0/build /build/rr/src/rr-4.5.0/build /build/rr/src/rr-4.5.0/build/CMakeFiles/tls_32.dir/DependInfo.cmake --color=
Scanning dependencies of target tls_32
make[2]: Leaving directory '/build/rr/src/rr-4.5.0/build'
make -f CMakeFiles/tls_32.dir/build.make CMakeFiles/tls_32.dir/build
make[2]: Entering directory '/build/rr/src/rr-4.5.0/build'
[  1%] Building C object CMakeFiles/tls_32.dir/32/tls.c.o
/usr/bin/cc -DRR_VERSION=\"4.5.0\" -I/build/rr/src/rr-4.5.0/include -I/build/rr/src/rr-4.5.0/third-party/proc-service -I/build/rr/src/rr-4.5.0/build  -march=x86-64 -mtune=generic -O2 -pipe -fstack-protector-strong --param=ssp-buffer-size=4 -fPIC -pthread -g3 -Wall -Wextra -Wstrict-prototypes -std=gnu11   -O2   -m32 -O0 -Werror -DDEBUG -o CMakeFiles/tls_32.dir/32/tls.c.o   -c /build/rr/src/rr-4.5.0/build/32/tls.c
[  1%] Linking C executable bin/tls_32
/usr/bin/cmake -E cmake_link_script CMakeFiles/tls_32.dir/link.txt --verbose=1
/usr/bin/cc -march=x86-64 -mtune=generic -O2 -pipe -fstack-protector-strong --param=ssp-buffer-size=4 -fPIC -pthread -g3 -Wall -Wextra -Wstrict-prototypes -std=gnu11   -O2  -Wl,-O1,--sort-common,--as-needed,-z,relro -rdynamic -m32 -O0 -Werror -DDEBUG CMakeFiles/tls_32.dir/32/tls.c.o  -o bin/tls_32 -lrt -ldl 
make[2]: Leaving directory '/build/rr/src/rr-4.5.0/build'
[  1%] Built target tls_32
make -f CMakeFiles/threads_32.dir/build.make CMakeFiles/threads_32.dir/depend
make[2]: Entering directory '/build/rr/src/rr-4.5.0/build'
cd /build/rr/src/rr-4.5.0/build && /usr/bin/cmake -E cmake_depends "Unix Makefiles" /build/rr/src/rr-4.5.0 /build/rr/src/rr-4.5.0 /build/rr/src/rr-4.5.0/build /build/rr/src/rr-4.5.0/build /build/rr/src/rr-4.5.0/build/CMakeFiles/threads_32.dir/DependInfo.cmake --color=
Scanning dependencies of target threads_32
make[2]: Leaving directory '/build/rr/src/rr-4.5.0/build'
make -f CMakeFiles/threads_32.dir/build.make CMakeFiles/threads_32.dir/build
make[2]: Entering directory '/build/rr/src/rr-4.5.0/build'
[  1%] Building C object CMakeFiles/threads_32.dir/32/threads.c.o
/usr/bin/cc -DRR_VERSION=\"4.5.0\" -I/build/rr/src/rr-4.5.0/include -I/build/rr/src/rr-4.5.0/third-party/proc-service -I/build/rr/src/rr-4.5.0/build  -march=x86-64 -mtune=generic -O2 -pipe -fstack-protector-strong --param=ssp-buffer-size=4 -fPIC -pthread -g3 -Wall -Wextra -Wstrict-prototypes -std=gnu11   -O2   -m32 -O0 -Werror -DDEBUG -o CMakeFiles/threads_32.dir/32/threads.c.o   -c /build/rr/src/rr-4.5.0/build/32/threads.c
[  1%] Linking C executable bin/threads_32
/usr/bin/cmake -E cmake_link_script CMakeFiles/threads_32.dir/link.txt --verbose=1
/usr/bin/cc -march=x86-64 -mtune=generic -O2 -pipe -fstack-protector-strong --param=ssp-buffer-size=4 -fPIC -pthread -g3 -Wall -Wextra -Wstrict-prototypes -std=gnu11   -O2  -Wl,-O1,--sort-common,--as-needed,-z,relro -rdynamic -m32 -O0 -Werror -DDEBUG CMakeFiles/threads_32.dir/32/threads.c.o  -o bin/threads_32 -lrt -ldl 
make[2]: Leaving directory '/build/rr/src/rr-4.5.0/build'
[  1%] Built target threads_32
make -f CMakeFiles/thread_exit_signal_32.dir/build.make CMakeFiles/thread_exit_signal_32.dir/depend
make[2]: Entering directory '/build/rr/src/rr-4.5.0/build'
cd /build/rr/src/rr-4.5.0/build && /usr/bin/cmake -E cmake_depends "Unix Makefiles" /build/rr/src/rr-4.5.0 /build/rr/src/rr-4.5.0 /build/rr/src/rr-4.5.0/build /build/rr/src/rr-4.5.0/build /build/rr/src/rr-4.5.0/build/CMakeFiles/thread_exit_signal_32.dir/DependInfo.cmake --color=
Scanning dependencies of target thread_exit_signal_32
make[2]: Leaving directory '/build/rr/src/rr-4.5.0/build'
make -f CMakeFiles/thread_exit_signal_32.dir/build.make CMakeFiles/thread_exit_signal_32.dir/build
make[2]: Entering directory '/build/rr/src/rr-4.5.0/build'
[  1%] Building C object CMakeFiles/thread_exit_signal_32.dir/32/thread_exit_signal.c.o
/usr/bin/cc -DRR_VERSION=\"4.5.0\" -I/build/rr/src/rr-4.5.0/include -I/build/rr/src/rr-4.5.0/third-party/proc-service -I/build/rr/src/rr-4.5.0/build  -march=x86-64 -mtune=generic -O2 -pipe -fstack-protector-strong --param=ssp-buffer-size=4 -fPIC -pthread -g3 -Wall -Wextra -Wstrict-prototypes -std=gnu11   -O2   -m32 -O0 -Werror -DDEBUG -o CMakeFiles/thread_exit_signal_32.dir/32/thread_exit_signal.c.o   -c /build/rr/src/rr-4.5.0/build/32/thread_exit_signal.c
[  1%] Linking C executable bin/thread_exit_signal_32
/usr/bin/cmake -E cmake_link_script CMakeFiles/thread_exit_signal_32.dir/link.txt --verbose=1
/usr/bin/cc -march=x86-64 -mtune=generic -O2 -pipe -fstack-protector-strong --param=ssp-buffer-size=4 -fPIC -pthread -g3 -Wall -Wextra -Wstrict-prototypes -std=gnu11   -O2  -Wl,-O1,--sort-common,--as-needed,-z,relro -rdynamic -m32 -O0 -Werror -DDEBUG CMakeFiles/thread_exit_signal_32.dir/32/thread_exit_signal.c.o  -o bin/thread_exit_signal_32 -lrt -ldl 
make[2]: Leaving directory '/build/rr/src/rr-4.5.0/build'
[  1%] Built target thread_exit_signal_32
make -f CMakeFiles/term_nonmain_32.dir/build.make CMakeFiles/term_nonmain_32.dir/depend
make[2]: Entering directory '/build/rr/src/rr-4.5.0/build'
cd /build/rr/src/rr-4.5.0/build && /usr/bin/cmake -E cmake_depends "Unix Makefiles" /build/rr/src/rr-4.5.0 /build/rr/src/rr-4.5.0 /build/rr/src/rr-4.5.0/build /build/rr/src/rr-4.5.0/build /build/rr/src/rr-4.5.0/build/CMakeFiles/term_nonmain_32.dir/DependInfo.cmake --color=
Scanning dependencies of target term_nonmain_32
make[2]: Leaving directory '/build/rr/src/rr-4.5.0/build'
make -f CMakeFiles/term_nonmain_32.dir/build.make CMakeFiles/term_nonmain_32.dir/build
make[2]: Entering directory '/build/rr/src/rr-4.5.0/build'
[  1%] Building C object CMakeFiles/term_nonmain_32.dir/32/term_nonmain.c.o
/usr/bin/cc -DRR_VERSION=\"4.5.0\" -I/build/rr/src/rr-4.5.0/include -I/build/rr/src/rr-4.5.0/third-party/proc-service -I/build/rr/src/rr-4.5.0/build  -march=x86-64 -mtune=generic -O2 -pipe -fstack-protector-strong --param=ssp-buffer-size=4 -fPIC -pthread -g3 -Wall -Wextra -Wstrict-prototypes -std=gnu11   -O2   -m32 -O0 -Werror -DDEBUG -o CMakeFiles/term_nonmain_32.dir/32/term_nonmain.c.o   -c /build/rr/src/rr-4.5.0/build/32/term_nonmain.c
[  1%] Linking C executable bin/term_nonmain_32
/usr/bin/cmake -E cmake_link_script CMakeFiles/term_nonmain_32.dir/link.txt --verbose=1
/usr/bin/cc -march=x86-64 -mtune=generic -O2 -pipe -fstack-protector-strong --param=ssp-buffer-size=4 -fPIC -pthread -g3 -Wall -Wextra -Wstrict-prototypes -std=gnu11   -O2  -Wl,-O1,--sort-common,--as-needed,-z,relro -rdynamic -m32 -O0 -Werror -DDEBUG CMakeFiles/term_nonmain_32.dir/32/term_nonmain.c.o  -o bin/term_nonmain_32 -lrt -ldl 
make[2]: Leaving directory '/build/rr/src/rr-4.5.0/build'
[  1%] Built target term_nonmain_32
make -f CMakeFiles/target_process_32.dir/build.make CMakeFiles/target_process_32.dir/depend
make[2]: Entering directory '/build/rr/src/rr-4.5.0/build'
cd /build/rr/src/rr-4.5.0/build && /usr/bin/cmake -E cmake_depends "Unix Makefiles" /build/rr/src/rr-4.5.0 /build/rr/src/rr-4.5.0 /build/rr/src/rr-4.5.0/build /build/rr/src/rr-4.5.0/build /build/rr/src/rr-4.5.0/build/CMakeFiles/target_process_32.dir/DependInfo.cmake --color=
Scanning dependencies of target target_process_32
make[2]: Leaving directory '/build/rr/src/rr-4.5.0/build'
make -f CMakeFiles/target_process_32.dir/build.make CMakeFiles/target_process_32.dir/build
make[2]: Entering directory '/build/rr/src/rr-4.5.0/build'
[  1%] Building C object CMakeFiles/target_process_32.dir/32/target_process.c.o
/usr/bin/cc -DRR_VERSION=\"4.5.0\" -I/build/rr/src/rr-4.5.0/include -I/build/rr/src/rr-4.5.0/third-party/proc-service -I/build/rr/src/rr-4.5.0/build  -march=x86-64 -mtune=generic -O2 -pipe -fstack-protector-strong --param=ssp-buffer-size=4 -fPIC -pthread -g3 -Wall -Wextra -Wstrict-prototypes -std=gnu11   -O2   -m32 -O0 -Werror -DDEBUG -o CMakeFiles/target_process_32.dir/32/target_process.c.o   -c /build/rr/src/rr-4.5.0/build/32/target_process.c
[  1%] Linking C executable bin/target_process_32
/usr/bin/cmake -E cmake_link_script CMakeFiles/target_process_32.dir/link.txt --verbose=1
/usr/bin/cc -march=x86-64 -mtune=generic -O2 -pipe -fstack-protector-strong --param=ssp-buffer-size=4 -fPIC -pthread -g3 -Wall -Wextra -Wstrict-prototypes -std=gnu11   -O2  -Wl,-O1,--sort-common,--as-needed,-z,relro -rdynamic -m32 -O0 -Werror -DDEBUG CMakeFiles/target_process_32.dir/32/target_process.c.o  -o bin/target_process_32 -lrt -ldl 
make[2]: Leaving directory '/build/rr/src/rr-4.5.0/build'
[  1%] Built target target_process_32
make -f CMakeFiles/string_instructions_watch_32.dir/build.make CMakeFiles/string_instructions_watch_32.dir/depend
make[2]: Entering directory '/build/rr/src/rr-4.5.0/build'
cd /build/rr/src/rr-4.5.0/build && /usr/bin/cmake -E cmake_depends "Unix Makefiles" /build/rr/src/rr-4.5.0 /build/rr/src/rr-4.5.0 /build/rr/src/rr-4.5.0/build /build/rr/src/rr-4.5.0/build /build/rr/src/rr-4.5.0/build/CMakeFiles/string_instructions_watch_32.dir/DependInfo.cmake --color=
Scanning dependencies of target string_instructions_watch_32
make[2]: Leaving directory '/build/rr/src/rr-4.5.0/build'
make -f CMakeFiles/string_instructions_watch_32.dir/build.make CMakeFiles/string_instructions_watch_32.dir/build
make[2]: Entering directory '/build/rr/src/rr-4.5.0/build'
[  1%] Building C object CMakeFiles/string_instructions_watch_32.dir/32/string_instructions_watch.c.o
/usr/bin/cc -DRR_VERSION=\"4.5.0\" -I/build/rr/src/rr-4.5.0/include -I/build/rr/src/rr-4.5.0/third-party/proc-service -I/build/rr/src/rr-4.5.0/build  -march=x86-64 -mtune=generic -O2 -pipe -fstack-protector-strong --param=ssp-buffer-size=4 -fPIC -pthread -g3 -Wall -Wextra -Wstrict-prototypes -std=gnu11   -O2   -m32 -O0 -Werror -DDEBUG -o CMakeFiles/string_instructions_watch_32.dir/32/string_instructions_watch.c.o   -c /build/rr/src/rr-4.5.0/build/32/string_instructions_watch.c
[  1%] Linking C executable bin/string_instructions_watch_32
/usr/bin/cmake -E cmake_link_script CMakeFiles/string_instructions_watch_32.dir/link.txt --verbose=1
/usr/bin/cc -march=x86-64 -mtune=generic -O2 -pipe -fstack-protector-strong --param=ssp-buffer-size=4 -fPIC -pthread -g3 -Wall -Wextra -Wstrict-prototypes -std=gnu11   -O2  -Wl,-O1,--sort-common,--as-needed,-z,relro -rdynamic -m32 -O0 -Werror -DDEBUG CMakeFiles/string_instructions_watch_32.dir/32/string_instructions_watch.c.o  -o bin/string_instructions_watch_32 -lrt -ldl 
make[2]: Leaving directory '/build/rr/src/rr-4.5.0/build'
[  1%] Built target string_instructions_watch_32
make -f CMakeFiles/string_instructions_multiwatch_32.dir/build.make CMakeFiles/string_instructions_multiwatch_32.dir/depend
make[2]: Entering directory '/build/rr/src/rr-4.5.0/build'
cd /build/rr/src/rr-4.5.0/build && /usr/bin/cmake -E cmake_depends "Unix Makefiles" /build/rr/src/rr-4.5.0 /build/rr/src/rr-4.5.0 /build/rr/src/rr-4.5.0/build /build/rr/src/rr-4.5.0/build /build/rr/src/rr-4.5.0/build/CMakeFiles/string_instructions_multiwatch_32.dir/DependInfo.cmake --color=
Scanning dependencies of target string_instructions_multiwatch_32
make[2]: Leaving directory '/build/rr/src/rr-4.5.0/build'
make -f CMakeFiles/string_instructions_multiwatch_32.dir/build.make CMakeFiles/string_instructions_multiwatch_32.dir/build
make[2]: Entering directory '/build/rr/src/rr-4.5.0/build'
[  1%] Building C object CMakeFiles/string_instructions_multiwatch_32.dir/32/string_instructions_multiwatch.c.o
/usr/bin/cc -DRR_VERSION=\"4.5.0\" -I/build/rr/src/rr-4.5.0/include -I/build/rr/src/rr-4.5.0/third-party/proc-service -I/build/rr/src/rr-4.5.0/build  -march=x86-64 -mtune=generic -O2 -pipe -fstack-protector-strong --param=ssp-buffer-size=4 -fPIC -pthread -g3 -Wall -Wextra -Wstrict-prototypes -std=gnu11   -O2   -m32 -O0 -Werror -DDEBUG -o CMakeFiles/string_instructions_multiwatch_32.dir/32/string_instructions_multiwatch.c.o   -c /build/rr/src/rr-4.5.0/build/32/string_instructions_multiwatch.c
[  1%] Linking C executable bin/string_instructions_multiwatch_32
/usr/bin/cmake -E cmake_link_script CMakeFiles/string_instructions_multiwatch_32.dir/link.txt --verbose=1
/usr/bin/cc -march=x86-64 -mtune=generic -O2 -pipe -fstack-protector-strong --param=ssp-buffer-size=4 -fPIC -pthread -g3 -Wall -Wextra -Wstrict-prototypes -std=gnu11   -O2  -Wl,-O1,--sort-common,--as-needed,-z,relro -rdynamic -m32 -O0 -Werror -DDEBUG CMakeFiles/string_instructions_multiwatch_32.dir/32/string_instructions_multiwatch.c.o  -o bin/string_instructions_multiwatch_32 -lrt -ldl 
make[2]: Leaving directory '/build/rr/src/rr-4.5.0/build'
[  1%] Built target string_instructions_multiwatch_32
make -f CMakeFiles/string_instructions_async_signals_32.dir/build.make CMakeFiles/string_instructions_async_signals_32.dir/depend
make[2]: Entering directory '/build/rr/src/rr-4.5.0/build'
cd /build/rr/src/rr-4.5.0/build && /usr/bin/cmake -E cmake_depends "Unix Makefiles" /build/rr/src/rr-4.5.0 /build/rr/src/rr-4.5.0 /build/rr/src/rr-4.5.0/build /build/rr/src/rr-4.5.0/build /build/rr/src/rr-4.5.0/build/CMakeFiles/string_instructions_async_signals_32.dir/DependInfo.cmake --color=
Scanning dependencies of target string_instructions_async_signals_32
make[2]: Leaving directory '/build/rr/src/rr-4.5.0/build'
make -f CMakeFiles/string_instructions_async_signals_32.dir/build.make CMakeFiles/string_instructions_async_signals_32.dir/build
make[2]: Entering directory '/build/rr/src/rr-4.5.0/build'
[  1%] Building C object CMakeFiles/string_instructions_async_signals_32.dir/32/string_instructions_async_signals.c.o
/usr/bin/cc -DRR_VERSION=\"4.5.0\" -I/build/rr/src/rr-4.5.0/include -I/build/rr/src/rr-4.5.0/third-party/proc-service -I/build/rr/src/rr-4.5.0/build  -march=x86-64 -mtune=generic -O2 -pipe -fstack-protector-strong --param=ssp-buffer-size=4 -fPIC -pthread -g3 -Wall -Wextra -Wstrict-prototypes -std=gnu11   -O2   -m32 -O0 -Werror -DDEBUG -o CMakeFiles/string_instructions_async_signals_32.dir/32/string_instructions_async_signals.c.o   -c /build/rr/src/rr-4.5.0/build/32/string_instructions_async_signals.c
[  1%] Linking C executable bin/string_instructions_async_signals_32
/usr/bin/cmake -E cmake_link_script CMakeFiles/string_instructions_async_signals_32.dir/link.txt --verbose=1
/usr/bin/cc -march=x86-64 -mtune=generic -O2 -pipe -fstack-protector-strong --param=ssp-buffer-size=4 -fPIC -pthread -g3 -Wall -Wextra -Wstrict-prototypes -std=gnu11   -O2  -Wl,-O1,--sort-common,--as-needed,-z,relro -rdynamic -m32 -O0 -Werror -DDEBUG CMakeFiles/string_instructions_async_signals_32.dir/32/string_instructions_async_signals.c.o  -o bin/string_instructions_async_signals_32 -lrt -ldl 
make[2]: Leaving directory '/build/rr/src/rr-4.5.0/build'
[  1%] Built target string_instructions_async_signals_32
make -f CMakeFiles/step_thread_32.dir/build.make CMakeFiles/step_thread_32.dir/depend
make[2]: Entering directory '/build/rr/src/rr-4.5.0/build'
cd /build/rr/src/rr-4.5.0/build && /usr/bin/cmake -E cmake_depends "Unix Makefiles" /build/rr/src/rr-4.5.0 /build/rr/src/rr-4.5.0 /build/rr/src/rr-4.5.0/build /build/rr/src/rr-4.5.0/build /build/rr/src/rr-4.5.0/build/CMakeFiles/step_thread_32.dir/DependInfo.cmake --color=
Scanning dependencies of target step_thread_32
make[2]: Leaving directory '/build/rr/src/rr-4.5.0/build'
make -f CMakeFiles/step_thread_32.dir/build.make CMakeFiles/step_thread_32.dir/build
make[2]: Entering directory '/build/rr/src/rr-4.5.0/build'
[  1%] Building C object CMakeFiles/step_thread_32.dir/32/step_thread.c.o
/usr/bin/cc -DRR_VERSION=\"4.5.0\" -I/build/rr/src/rr-4.5.0/include -I/build/rr/src/rr-4.5.0/third-party/proc-service -I/build/rr/src/rr-4.5.0/build  -march=x86-64 -mtune=generic -O2 -pipe -fstack-protector-strong --param=ssp-buffer-size=4 -fPIC -pthread -g3 -Wall -Wextra -Wstrict-prototypes -std=gnu11   -O2   -m32 -O0 -Werror -DDEBUG -o CMakeFiles/step_thread_32.dir/32/step_thread.c.o   -c /build/rr/src/rr-4.5.0/build/32/step_thread.c
[  1%] Linking C executable bin/step_thread_32
/usr/bin/cmake -E cmake_link_script CMakeFiles/step_thread_32.dir/link.txt --verbose=1
/usr/bin/cc -march=x86-64 -mtune=generic -O2 -pipe -fstack-protector-strong --param=ssp-buffer-size=4 -fPIC -pthread -g3 -Wall -Wextra -Wstrict-prototypes -std=gnu11   -O2  -Wl,-O1,--sort-common,--as-needed,-z,relro -rdynamic -m32 -O0 -Werror -DDEBUG CMakeFiles/step_thread_32.dir/32/step_thread.c.o  -o bin/step_thread_32 -lrt -ldl 
make[2]: Leaving directory '/build/rr/src/rr-4.5.0/build'
[  1%] Built target step_thread_32
make -f CMakeFiles/starvation_singlethreaded.dir/build.make CMakeFiles/starvation_singlethreaded.dir/depend
make[2]: Entering directory '/build/rr/src/rr-4.5.0/build'
cd /build/rr/src/rr-4.5.0/build && /usr/bin/cmake -E cmake_depends "Unix Makefiles" /build/rr/src/rr-4.5.0 /build/rr/src/rr-4.5.0 /build/rr/src/rr-4.5.0/build /build/rr/src/rr-4.5.0/build /build/rr/src/rr-4.5.0/build/CMakeFiles/starvation_singlethreaded.dir/DependInfo.cmake --color=
Scanning dependencies of target starvation_singlethreaded
make[2]: Leaving directory '/build/rr/src/rr-4.5.0/build'
make -f CMakeFiles/starvation_singlethreaded.dir/build.make CMakeFiles/starvation_singlethreaded.dir/build
make[2]: Entering directory '/build/rr/src/rr-4.5.0/build'
[  1%] Building C object CMakeFiles/starvation_singlethreaded.dir/src/chaos-test/starvation_singlethreaded.c.o
/usr/bin/cc -DRR_VERSION=\"4.5.0\" -I/build/rr/src/rr-4.5.0/include -I/build/rr/src/rr-4.5.0/third-party/proc-service -I/build/rr/src/rr-4.5.0/build  -march=x86-64 -mtune=generic -O2 -pipe -fstack-protector-strong --param=ssp-buffer-size=4 -fPIC -pthread -g3 -Wall -Wextra -Wstrict-prototypes -std=gnu11   -O2   -o CMakeFiles/starvation_singlethreaded.dir/src/chaos-test/starvation_singlethreaded.c.o   -c /build/rr/src/rr-4.5.0/src/chaos-test/starvation_singlethreaded.c
[  2%] Linking C executable bin/starvation_singlethreaded
/usr/bin/cmake -E cmake_link_script CMakeFiles/starvation_singlethreaded.dir/link.txt --verbose=1
/usr/bin/cc -march=x86-64 -mtune=generic -O2 -pipe -fstack-protector-strong --param=ssp-buffer-size=4 -fPIC -pthread -g3 -Wall -Wextra -Wstrict-prototypes -std=gnu11   -O2  -Wl,-O1,--sort-common,--as-needed,-z,relro -rdynamic CMakeFiles/starvation_singlethreaded.dir/src/chaos-test/starvation_singlethreaded.c.o  -o bin/starvation_singlethreaded -lrt 
make[2]: Leaving directory '/build/rr/src/rr-4.5.0/build'
[  2%] Built target starvation_singlethreaded
make -f CMakeFiles/shared_persistent_file_32.dir/build.make CMakeFiles/shared_persistent_file_32.dir/depend
make[2]: Entering directory '/build/rr/src/rr-4.5.0/build'
cd /build/rr/src/rr-4.5.0/build && /usr/bin/cmake -E cmake_depends "Unix Makefiles" /build/rr/src/rr-4.5.0 /build/rr/src/rr-4.5.0 /build/rr/src/rr-4.5.0/build /build/rr/src/rr-4.5.0/build /build/rr/src/rr-4.5.0/build/CMakeFiles/shared_persistent_file_32.dir/DependInfo.cmake --color=
Scanning dependencies of target shared_persistent_file_32
make[2]: Leaving directory '/build/rr/src/rr-4.5.0/build'
make -f CMakeFiles/shared_persistent_file_32.dir/build.make CMakeFiles/shared_persistent_file_32.dir/build
make[2]: Entering directory '/build/rr/src/rr-4.5.0/build'
[  2%] Building C object CMakeFiles/shared_persistent_file_32.dir/32/shared_persistent_file.c.o
/usr/bin/cc -DRR_VERSION=\"4.5.0\" -I/build/rr/src/rr-4.5.0/include -I/build/rr/src/rr-4.5.0/third-party/proc-service -I/build/rr/src/rr-4.5.0/build  -march=x86-64 -mtune=generic -O2 -pipe -fstack-protector-strong --param=ssp-buffer-size=4 -fPIC -pthread -g3 -Wall -Wextra -Wstrict-prototypes -std=gnu11   -O2   -m32 -O0 -Werror -DDEBUG -o CMakeFiles/shared_persistent_file_32.dir/32/shared_persistent_file.c.o   -c /build/rr/src/rr-4.5.0/build/32/shared_persistent_file.c
[  2%] Linking C executable bin/shared_persistent_file_32
/usr/bin/cmake -E cmake_link_script CMakeFiles/shared_persistent_file_32.dir/link.txt --verbose=1
/usr/bin/cc -march=x86-64 -mtune=generic -O2 -pipe -fstack-protector-strong --param=ssp-buffer-size=4 -fPIC -pthread -g3 -Wall -Wextra -Wstrict-prototypes -std=gnu11   -O2  -Wl,-O1,--sort-common,--as-needed,-z,relro -rdynamic -m32 -O0 -Werror -DDEBUG CMakeFiles/shared_persistent_file_32.dir/32/shared_persistent_file.c.o  -o bin/shared_persistent_file_32 -lrt -ldl 
make[2]: Leaving directory '/build/rr/src/rr-4.5.0/build'
[  2%] Built target shared_persistent_file_32
make -f CMakeFiles/shared_map_32.dir/build.make CMakeFiles/shared_map_32.dir/depend
make[2]: Entering directory '/build/rr/src/rr-4.5.0/build'
cd /build/rr/src/rr-4.5.0/build && /usr/bin/cmake -E cmake_depends "Unix Makefiles" /build/rr/src/rr-4.5.0 /build/rr/src/rr-4.5.0 /build/rr/src/rr-4.5.0/build /build/rr/src/rr-4.5.0/build /build/rr/src/rr-4.5.0/build/CMakeFiles/shared_map_32.dir/DependInfo.cmake --color=
Scanning dependencies of target shared_map_32
make[2]: Leaving directory '/build/rr/src/rr-4.5.0/build'
make -f CMakeFiles/shared_map_32.dir/build.make CMakeFiles/shared_map_32.dir/build
make[2]: Entering directory '/build/rr/src/rr-4.5.0/build'
[  2%] Building C object CMakeFiles/shared_map_32.dir/32/shared_map.c.o
/usr/bin/cc -DRR_VERSION=\"4.5.0\" -I/build/rr/src/rr-4.5.0/include -I/build/rr/src/rr-4.5.0/third-party/proc-service -I/build/rr/src/rr-4.5.0/build  -march=x86-64 -mtune=generic -O2 -pipe -fstack-protector-strong --param=ssp-buffer-size=4 -fPIC -pthread -g3 -Wall -Wextra -Wstrict-prototypes -std=gnu11   -O2   -m32 -O0 -Werror -DDEBUG -o CMakeFiles/shared_map_32.dir/32/shared_map.c.o   -c /build/rr/src/rr-4.5.0/build/32/shared_map.c
[  2%] Linking C executable bin/shared_map_32
/usr/bin/cmake -E cmake_link_script CMakeFiles/shared_map_32.dir/link.txt --verbose=1
/usr/bin/cc -march=x86-64 -mtune=generic -O2 -pipe -fstack-protector-strong --param=ssp-buffer-size=4 -fPIC -pthread -g3 -Wall -Wextra -Wstrict-prototypes -std=gnu11   -O2  -Wl,-O1,--sort-common,--as-needed,-z,relro -rdynamic -m32 -O0 -Werror -DDEBUG CMakeFiles/shared_map_32.dir/32/shared_map.c.o  -o bin/shared_map_32 -lrt -ldl 
make[2]: Leaving directory '/build/rr/src/rr-4.5.0/build'
[  2%] Built target shared_map_32
make -f CMakeFiles/segfault_32.dir/build.make CMakeFiles/segfault_32.dir/depend
make[2]: Entering directory '/build/rr/src/rr-4.5.0/build'
cd /build/rr/src/rr-4.5.0/build && /usr/bin/cmake -E cmake_depends "Unix Makefiles" /build/rr/src/rr-4.5.0 /build/rr/src/rr-4.5.0 /build/rr/src/rr-4.5.0/build /build/rr/src/rr-4.5.0/build /build/rr/src/rr-4.5.0/build/CMakeFiles/segfault_32.dir/DependInfo.cmake --color=
Scanning dependencies of target segfault_32
make[2]: Leaving directory '/build/rr/src/rr-4.5.0/build'
make -f CMakeFiles/segfault_32.dir/build.make CMakeFiles/segfault_32.dir/build
make[2]: Entering directory '/build/rr/src/rr-4.5.0/build'
[  2%] Building C object CMakeFiles/segfault_32.dir/32/segfault.c.o
/usr/bin/cc -DRR_VERSION=\"4.5.0\" -I/build/rr/src/rr-4.5.0/include -I/build/rr/src/rr-4.5.0/third-party/proc-service -I/build/rr/src/rr-4.5.0/build  -march=x86-64 -mtune=generic -O2 -pipe -fstack-protector-strong --param=ssp-buffer-size=4 -fPIC -pthread -g3 -Wall -Wextra -Wstrict-prototypes -std=gnu11   -O2   -m32 -O0 -Werror -DDEBUG -o CMakeFiles/segfault_32.dir/32/segfault.c.o   -c /build/rr/src/rr-4.5.0/build/32/segfault.c
[  2%] Linking C executable bin/segfault_32
/usr/bin/cmake -E cmake_link_script CMakeFiles/segfault_32.dir/link.txt --verbose=1
/usr/bin/cc -march=x86-64 -mtune=generic -O2 -pipe -fstack-protector-strong --param=ssp-buffer-size=4 -fPIC -pthread -g3 -Wall -Wextra -Wstrict-prototypes -std=gnu11   -O2  -Wl,-O1,--sort-common,--as-needed,-z,relro -rdynamic -m32 -O0 -Werror -DDEBUG CMakeFiles/segfault_32.dir/32/segfault.c.o  -o bin/segfault_32 -lrt -ldl 
make[2]: Leaving directory '/build/rr/src/rr-4.5.0/build'
[  2%] Built target segfault_32
make -f CMakeFiles/reverse_step_long_32.dir/build.make CMakeFiles/reverse_step_long_32.dir/depend
make[2]: Entering directory '/build/rr/src/rr-4.5.0/build'
cd /build/rr/src/rr-4.5.0/build && /usr/bin/cmake -E cmake_depends "Unix Makefiles" /build/rr/src/rr-4.5.0 /build/rr/src/rr-4.5.0 /build/rr/src/rr-4.5.0/build /build/rr/src/rr-4.5.0/build /build/rr/src/rr-4.5.0/build/CMakeFiles/reverse_step_long_32.dir/DependInfo.cmake --color=
Scanning dependencies of target reverse_step_long_32
make[2]: Leaving directory '/build/rr/src/rr-4.5.0/build'
make -f CMakeFiles/reverse_step_long_32.dir/build.make CMakeFiles/reverse_step_long_32.dir/build
make[2]: Entering directory '/build/rr/src/rr-4.5.0/build'
[  2%] Building C object CMakeFiles/reverse_step_long_32.dir/32/reverse_step_long.c.o
/usr/bin/cc -DRR_VERSION=\"4.5.0\" -I/build/rr/src/rr-4.5.0/include -I/build/rr/src/rr-4.5.0/third-party/proc-service -I/build/rr/src/rr-4.5.0/build  -march=x86-64 -mtune=generic -O2 -pipe -fstack-protector-strong --param=ssp-buffer-size=4 -fPIC -pthread -g3 -Wall -Wextra -Wstrict-prototypes -std=gnu11   -O2   -m32 -O0 -Werror -DDEBUG -o CMakeFiles/reverse_step_long_32.dir/32/reverse_step_long.c.o   -c /build/rr/src/rr-4.5.0/build/32/reverse_step_long.c
[  2%] Linking C executable bin/reverse_step_long_32
/usr/bin/cmake -E cmake_link_script CMakeFiles/reverse_step_long_32.dir/link.txt --verbose=1
/usr/bin/cc -march=x86-64 -mtune=generic -O2 -pipe -fstack-protector-strong --param=ssp-buffer-size=4 -fPIC -pthread -g3 -Wall -Wextra -Wstrict-prototypes -std=gnu11   -O2  -Wl,-O1,--sort-common,--as-needed,-z,relro -rdynamic -m32 -O0 -Werror -DDEBUG CMakeFiles/reverse_step_long_32.dir/32/reverse_step_long.c.o  -o bin/reverse_step_long_32 -lrt -ldl 
make[2]: Leaving directory '/build/rr/src/rr-4.5.0/build'
[  2%] Built target reverse_step_long_32
make -f CMakeFiles/reverse_continue_process_signal_32.dir/build.make CMakeFiles/reverse_continue_process_signal_32.dir/depend
make[2]: Entering directory '/build/rr/src/rr-4.5.0/build'
cd /build/rr/src/rr-4.5.0/build && /usr/bin/cmake -E cmake_depends "Unix Makefiles" /build/rr/src/rr-4.5.0 /build/rr/src/rr-4.5.0 /build/rr/src/rr-4.5.0/build /build/rr/src/rr-4.5.0/build /build/rr/src/rr-4.5.0/build/CMakeFiles/reverse_continue_process_signal_32.dir/DependInfo.cmake --color=
Scanning dependencies of target reverse_continue_process_signal_32
make[2]: Leaving directory '/build/rr/src/rr-4.5.0/build'
make -f CMakeFiles/reverse_continue_process_signal_32.dir/build.make CMakeFiles/reverse_continue_process_signal_32.dir/build
make[2]: Entering directory '/build/rr/src/rr-4.5.0/build'
[  2%] Building C object CMakeFiles/reverse_continue_process_signal_32.dir/32/reverse_continue_process_signal.c.o
/usr/bin/cc -DRR_VERSION=\"4.5.0\" -I/build/rr/src/rr-4.5.0/include -I/build/rr/src/rr-4.5.0/third-party/proc-service -I/build/rr/src/rr-4.5.0/build  -march=x86-64 -mtune=generic -O2 -pipe -fstack-protector-strong --param=ssp-buffer-size=4 -fPIC -pthread -g3 -Wall -Wextra -Wstrict-prototypes -std=gnu11   -O2   -m32 -O0 -Werror -DDEBUG -o CMakeFiles/reverse_continue_process_signal_32.dir/32/reverse_continue_process_signal.c.o   -c /build/rr/src/rr-4.5.0/build/32/reverse_continue_process_signal.c
[  2%] Linking C executable bin/reverse_continue_process_signal_32
/usr/bin/cmake -E cmake_link_script CMakeFiles/reverse_continue_process_signal_32.dir/link.txt --verbose=1
/usr/bin/cc -march=x86-64 -mtune=generic -O2 -pipe -fstack-protector-strong --param=ssp-buffer-size=4 -fPIC -pthread -g3 -Wall -Wextra -Wstrict-prototypes -std=gnu11   -O2  -Wl,-O1,--sort-common,--as-needed,-z,relro -rdynamic -m32 -O0 -Werror -DDEBUG CMakeFiles/reverse_continue_process_signal_32.dir/32/reverse_continue_process_signal.c.o  -o bin/reverse_continue_process_signal_32 -lrt -ldl 
make[2]: Leaving directory '/build/rr/src/rr-4.5.0/build'
[  2%] Built target reverse_continue_process_signal_32
make -f CMakeFiles/reverse_continue_multiprocess_32.dir/build.make CMakeFiles/reverse_continue_multiprocess_32.dir/depend
make[2]: Entering directory '/build/rr/src/rr-4.5.0/build'
cd /build/rr/src/rr-4.5.0/build && /usr/bin/cmake -E cmake_depends "Unix Makefiles" /build/rr/src/rr-4.5.0 /build/rr/src/rr-4.5.0 /build/rr/src/rr-4.5.0/build /build/rr/src/rr-4.5.0/build /build/rr/src/rr-4.5.0/build/CMakeFiles/reverse_continue_multiprocess_32.dir/DependInfo.cmake --color=
Scanning dependencies of target reverse_continue_multiprocess_32
make[2]: Leaving directory '/build/rr/src/rr-4.5.0/build'
make -f CMakeFiles/reverse_continue_multiprocess_32.dir/build.make CMakeFiles/reverse_continue_multiprocess_32.dir/build
make[2]: Entering directory '/build/rr/src/rr-4.5.0/build'
[  2%] Building C object CMakeFiles/reverse_continue_multiprocess_32.dir/32/reverse_continue_multiprocess.c.o
/usr/bin/cc -DRR_VERSION=\"4.5.0\" -I/build/rr/src/rr-4.5.0/include -I/build/rr/src/rr-4.5.0/third-party/proc-service -I/build/rr/src/rr-4.5.0/build  -march=x86-64 -mtune=generic -O2 -pipe -fstack-protector-strong --param=ssp-buffer-size=4 -fPIC -pthread -g3 -Wall -Wextra -Wstrict-prototypes -std=gnu11   -O2   -m32 -O0 -Werror -DDEBUG -o CMakeFiles/reverse_continue_multiprocess_32.dir/32/reverse_continue_multiprocess.c.o   -c /build/rr/src/rr-4.5.0/build/32/reverse_continue_multiprocess.c
[  2%] Linking C executable bin/reverse_continue_multiprocess_32
/usr/bin/cmake -E cmake_link_script CMakeFiles/reverse_continue_multiprocess_32.dir/link.txt --verbose=1
/usr/bin/cc -march=x86-64 -mtune=generic -O2 -pipe -fstack-protector-strong --param=ssp-buffer-size=4 -fPIC -pthread -g3 -Wall -Wextra -Wstrict-prototypes -std=gnu11   -O2  -Wl,-O1,--sort-common,--as-needed,-z,relro -rdynamic -m32 -O0 -Werror -DDEBUG CMakeFiles/reverse_continue_multiprocess_32.dir/32/reverse_continue_multiprocess.c.o  -o bin/reverse_continue_multiprocess_32 -lrt -ldl 
make[2]: Leaving directory '/build/rr/src/rr-4.5.0/build'
[  2%] Built target reverse_continue_multiprocess_32
make -f CMakeFiles/restart_abnormal_exit_32.dir/build.make CMakeFiles/restart_abnormal_exit_32.dir/depend
make[2]: Entering directory '/build/rr/src/rr-4.5.0/build'
cd /build/rr/src/rr-4.5.0/build && /usr/bin/cmake -E cmake_depends "Unix Makefiles" /build/rr/src/rr-4.5.0 /build/rr/src/rr-4.5.0 /build/rr/src/rr-4.5.0/build /build/rr/src/rr-4.5.0/build /build/rr/src/rr-4.5.0/build/CMakeFiles/restart_abnormal_exit_32.dir/DependInfo.cmake --color=
Scanning dependencies of target restart_abnormal_exit_32
make[2]: Leaving directory '/build/rr/src/rr-4.5.0/build'
make -f CMakeFiles/restart_abnormal_exit_32.dir/build.make CMakeFiles/restart_abnormal_exit_32.dir/build
make[2]: Entering directory '/build/rr/src/rr-4.5.0/build'
[  2%] Building C object CMakeFiles/restart_abnormal_exit_32.dir/32/restart_abnormal_exit.c.o
/usr/bin/cc -DRR_VERSION=\"4.5.0\" -I/build/rr/src/rr-4.5.0/include -I/build/rr/src/rr-4.5.0/third-party/proc-service -I/build/rr/src/rr-4.5.0/build  -march=x86-64 -mtune=generic -O2 -pipe -fstack-protector-strong --param=ssp-buffer-size=4 -fPIC -pthread -g3 -Wall -Wextra -Wstrict-prototypes -std=gnu11   -O2   -m32 -O0 -Werror -DDEBUG -o CMakeFiles/restart_abnormal_exit_32.dir/32/restart_abnormal_exit.c.o   -c /build/rr/src/rr-4.5.0/build/32/restart_abnormal_exit.c
[  2%] Linking C executable bin/restart_abnormal_exit_32
/usr/bin/cmake -E cmake_link_script CMakeFiles/restart_abnormal_exit_32.dir/link.txt --verbose=1
/usr/bin/cc -march=x86-64 -mtune=generic -O2 -pipe -fstack-protector-strong --param=ssp-buffer-size=4 -fPIC -pthread -g3 -Wall -Wextra -Wstrict-prototypes -std=gnu11   -O2  -Wl,-O1,--sort-common,--as-needed,-z,relro -rdynamic -m32 -O0 -Werror -DDEBUG CMakeFiles/restart_abnormal_exit_32.dir/32/restart_abnormal_exit.c.o  -o bin/restart_abnormal_exit_32 -lrt -ldl 
make[2]: Leaving directory '/build/rr/src/rr-4.5.0/build'
[  2%] Built target restart_abnormal_exit_32
make -f CMakeFiles/cpuid_32.dir/build.make CMakeFiles/cpuid_32.dir/depend
make[2]: Entering directory '/build/rr/src/rr-4.5.0/build'
cd /build/rr/src/rr-4.5.0/build && /usr/bin/cmake -E cmake_depends "Unix Makefiles" /build/rr/src/rr-4.5.0 /build/rr/src/rr-4.5.0 /build/rr/src/rr-4.5.0/build /build/rr/src/rr-4.5.0/build /build/rr/src/rr-4.5.0/build/CMakeFiles/cpuid_32.dir/DependInfo.cmake --color=
Scanning dependencies of target cpuid_32
make[2]: Leaving directory '/build/rr/src/rr-4.5.0/build'
make -f CMakeFiles/cpuid_32.dir/build.make CMakeFiles/cpuid_32.dir/build
make[2]: Entering directory '/build/rr/src/rr-4.5.0/build'
[  2%] Building C object CMakeFiles/cpuid_32.dir/32/cpuid.c.o
/usr/bin/cc -DRR_VERSION=\"4.5.0\" -I/build/rr/src/rr-4.5.0/include -I/build/rr/src/rr-4.5.0/third-party/proc-service -I/build/rr/src/rr-4.5.0/build  -march=x86-64 -mtune=generic -O2 -pipe -fstack-protector-strong --param=ssp-buffer-size=4 -fPIC -pthread -g3 -Wall -Wextra -Wstrict-prototypes -std=gnu11   -O2   -m32 -O0 -Werror -DDEBUG -o CMakeFiles/cpuid_32.dir/32/cpuid.c.o   -c /build/rr/src/rr-4.5.0/build/32/cpuid.c
[  2%] Building ASM object CMakeFiles/cpuid_32.dir/32/cpuid_loop.S.o
/usr/bin/cc -DRR_VERSION=\"4.5.0\" -I/build/rr/src/rr-4.5.0/include -I/build/rr/src/rr-4.5.0/third-party/proc-service -I/build/rr/src/rr-4.5.0/build  -g3  -O3 -DNDEBUG   -m32 -o CMakeFiles/cpuid_32.dir/32/cpuid_loop.S.o -c /build/rr/src/rr-4.5.0/build/32/cpuid_loop.S
[  3%] Linking C executable bin/cpuid_32
/usr/bin/cmake -E cmake_link_script CMakeFiles/cpuid_32.dir/link.txt --verbose=1
/usr/bin/cc -march=x86-64 -mtune=generic -O2 -pipe -fstack-protector-strong --param=ssp-buffer-size=4 -fPIC -pthread -g3 -Wall -Wextra -Wstrict-prototypes -std=gnu11   -O2  -Wl,-O1,--sort-common,--as-needed,-z,relro -rdynamic -m32 CMakeFiles/cpuid_32.dir/32/cpuid.c.o CMakeFiles/cpuid_32.dir/32/cpuid_loop.S.o  -o bin/cpuid_32 -lrt 
make[2]: Leaving directory '/build/rr/src/rr-4.5.0/build'
[  3%] Built target cpuid_32
make -f CMakeFiles/read_big_struct_32.dir/build.make CMakeFiles/read_big_struct_32.dir/depend
make[2]: Entering directory '/build/rr/src/rr-4.5.0/build'
cd /build/rr/src/rr-4.5.0/build && /usr/bin/cmake -E cmake_depends "Unix Makefiles" /build/rr/src/rr-4.5.0 /build/rr/src/rr-4.5.0 /build/rr/src/rr-4.5.0/build /build/rr/src/rr-4.5.0/build /build/rr/src/rr-4.5.0/build/CMakeFiles/read_big_struct_32.dir/DependInfo.cmake --color=
Scanning dependencies of target read_big_struct_32
make[2]: Leaving directory '/build/rr/src/rr-4.5.0/build'
make -f CMakeFiles/read_big_struct_32.dir/build.make CMakeFiles/read_big_struct_32.dir/build
make[2]: Entering directory '/build/rr/src/rr-4.5.0/build'
[  3%] Building C object CMakeFiles/read_big_struct_32.dir/32/read_big_struct.c.o
/usr/bin/cc -DRR_VERSION=\"4.5.0\" -I/build/rr/src/rr-4.5.0/include -I/build/rr/src/rr-4.5.0/third-party/proc-service -I/build/rr/src/rr-4.5.0/build  -march=x86-64 -mtune=generic -O2 -pipe -fstack-protector-strong --param=ssp-buffer-size=4 -fPIC -pthread -g3 -Wall -Wextra -Wstrict-prototypes -std=gnu11   -O2   -m32 -O0 -Werror -DDEBUG -o CMakeFiles/read_big_struct_32.dir/32/read_big_struct.c.o   -c /build/rr/src/rr-4.5.0/build/32/read_big_struct.c
[  3%] Linking C executable bin/read_big_struct_32
/usr/bin/cmake -E cmake_link_script CMakeFiles/read_big_struct_32.dir/link.txt --verbose=1
/usr/bin/cc -march=x86-64 -mtune=generic -O2 -pipe -fstack-protector-strong --param=ssp-buffer-size=4 -fPIC -pthread -g3 -Wall -Wextra -Wstrict-prototypes -std=gnu11   -O2  -Wl,-O1,--sort-common,--as-needed,-z,relro -rdynamic -m32 -O0 -Werror -DDEBUG CMakeFiles/read_big_struct_32.dir/32/read_big_struct.c.o  -o bin/read_big_struct_32 -lrt -ldl 
make[2]: Leaving directory '/build/rr/src/rr-4.5.0/build'
[  3%] Built target read_big_struct_32
make -f CMakeFiles/rr_ps_32.dir/build.make CMakeFiles/rr_ps_32.dir/depend
make[2]: Entering directory '/build/rr/src/rr-4.5.0/build'
cd /build/rr/src/rr-4.5.0/build && /usr/bin/cmake -E cmake_depends "Unix Makefiles" /build/rr/src/rr-4.5.0 /build/rr/src/rr-4.5.0 /build/rr/src/rr-4.5.0/build /build/rr/src/rr-4.5.0/build /build/rr/src/rr-4.5.0/build/CMakeFiles/rr_ps_32.dir/DependInfo.cmake --color=
Scanning dependencies of target rr_ps_32
make[2]: Leaving directory '/build/rr/src/rr-4.5.0/build'
make -f CMakeFiles/rr_ps_32.dir/build.make CMakeFiles/rr_ps_32.dir/build
make[2]: Entering directory '/build/rr/src/rr-4.5.0/build'
[  3%] Building C object CMakeFiles/rr_ps_32.dir/32/rr_ps.c.o
/usr/bin/cc -DRR_VERSION=\"4.5.0\" -I/build/rr/src/rr-4.5.0/include -I/build/rr/src/rr-4.5.0/third-party/proc-service -I/build/rr/src/rr-4.5.0/build  -march=x86-64 -mtune=generic -O2 -pipe -fstack-protector-strong --param=ssp-buffer-size=4 -fPIC -pthread -g3 -Wall -Wextra -Wstrict-prototypes -std=gnu11   -O2   -m32 -O0 -Werror -DDEBUG -o CMakeFiles/rr_ps_32.dir/32/rr_ps.c.o   -c /build/rr/src/rr-4.5.0/build/32/rr_ps.c
[  3%] Linking C executable bin/rr_ps_32
/usr/bin/cmake -E cmake_link_script CMakeFiles/rr_ps_32.dir/link.txt --verbose=1
/usr/bin/cc -march=x86-64 -mtune=generic -O2 -pipe -fstack-protector-strong --param=ssp-buffer-size=4 -fPIC -pthread -g3 -Wall -Wextra -Wstrict-prototypes -std=gnu11   -O2  -Wl,-O1,--sort-common,--as-needed,-z,relro -rdynamic -m32 -O0 -Werror -DDEBUG CMakeFiles/rr_ps_32.dir/32/rr_ps.c.o  -o bin/rr_ps_32 -lrt -ldl 
make[2]: Leaving directory '/build/rr/src/rr-4.5.0/build'
[  3%] Built target rr_ps_32
make -f CMakeFiles/ptrace_remote_unmap_32.dir/build.make CMakeFiles/ptrace_remote_unmap_32.dir/depend
make[2]: Entering directory '/build/rr/src/rr-4.5.0/build'
cd /build/rr/src/rr-4.5.0/build && /usr/bin/cmake -E cmake_depends "Unix Makefiles" /build/rr/src/rr-4.5.0 /build/rr/src/rr-4.5.0 /build/rr/src/rr-4.5.0/build /build/rr/src/rr-4.5.0/build /build/rr/src/rr-4.5.0/build/CMakeFiles/ptrace_remote_unmap_32.dir/DependInfo.cmake --color=
Scanning dependencies of target ptrace_remote_unmap_32
make[2]: Leaving directory '/build/rr/src/rr-4.5.0/build'
make -f CMakeFiles/ptrace_remote_unmap_32.dir/build.make CMakeFiles/ptrace_remote_unmap_32.dir/build
make[2]: Entering directory '/build/rr/src/rr-4.5.0/build'
[  3%] Building C object CMakeFiles/ptrace_remote_unmap_32.dir/32/ptrace_remote_unmap.c.o
/usr/bin/cc -DRR_VERSION=\"4.5.0\" -I/build/rr/src/rr-4.5.0/include -I/build/rr/src/rr-4.5.0/third-party/proc-service -I/build/rr/src/rr-4.5.0/build  -march=x86-64 -mtune=generic -O2 -pipe -fstack-protector-strong --param=ssp-buffer-size=4 -fPIC -pthread -g3 -Wall -Wextra -Wstrict-prototypes -std=gnu11   -O2   -m32 -O0 -Werror -DDEBUG -o CMakeFiles/ptrace_remote_unmap_32.dir/32/ptrace_remote_unmap.c.o   -c /build/rr/src/rr-4.5.0/build/32/ptrace_remote_unmap.c
In file included from /build/rr/src/rr-4.5.0/build/32/rrutil.h:16:0,
                 from /build/rr/src/rr-4.5.0/build/32/ptrace_remote_unmap.c:3:
/build/rr/src/rr-4.5.0/build/32/ptrace_remote_unmap.c: In function 'munmap_remote':
/build/rr/src/rr-4.5.0/build/32/ptrace_remote_unmap.c:53:10: error: suggest parentheses around assignment used as truth value [-Werror=parentheses]
   assert(wret = child);
          ^
/build/rr/src/rr-4.5.0/build/32/ptrace_remote_unmap.c:59:10: error: suggest parentheses around assignment used as truth value [-Werror=parentheses]
   assert(wret = child);
          ^
/build/rr/src/rr-4.5.0/build/32/ptrace_remote_unmap.c: In function 'main':
/build/rr/src/rr-4.5.0/build/32/ptrace_remote_unmap.c:117:10: error: suggest parentheses around assignment used as truth value [-Werror=parentheses]
   assert(wret = child);
          ^
/build/rr/src/rr-4.5.0/build/32/ptrace_remote_unmap.c:123:10: error: suggest parentheses around assignment used as truth value [-Werror=parentheses]
   assert(wret = child);
          ^
cc1: all warnings being treated as errors
make[2]: *** [CMakeFiles/ptrace_remote_unmap_32.dir/build.make:66: CMakeFiles/ptrace_remote_unmap_32.dir/32/ptrace_remote_unmap.c.o] Error 1
make[2]: Leaving directory '/build/rr/src/rr-4.5.0/build'
make[1]: *** [CMakeFiles/Makefile2:1176: CMakeFiles/ptrace_remote_unmap_32.dir/all] Error 2
make[1]: Leaving directory '/build/rr/src/rr-4.5.0/build'
make: *** [Makefile:166: all] Error 2
==> ERROR: A failure occurred in build().
    Aborting...
==> Removing installed dependencies...
checking dependencies...
:: glib2 optionally requires python: for gdbus-codegen and gtester-report
:: util-linux optionally requires python: python bindings to libmount

Packages (14) cmake-3.8.1-1  gdb-7.12.1-3  gdb-common-7.12.1-3  guile2.0-2.0.14-1  jsoncpp-1.8.0-1  lib32-zlib-1.2.11-1  libpfm4-4.7.0-2  libuv-1.12.0-1  libxml2-2.9.4+16+g07418011-2  python-3.6.1-1  python2-2.7.13-2  python2-pexpect-4.2.1-2  python2-ptyprocess-0.5.1-2  shared-mime-info-1.8-1

Total Removed Size:  263.03 MiB

:: Do you want to remove these packages? [Y/n] 
:: Running pre-transaction hooks...
(1/1) Removing old entries from the info directory file...
:: Processing package changes...
removing python2-pexpect...
removing python2-ptyprocess...
removing python2...
removing libpfm4...
removing lib32-zlib...
removing gdb...
removing gdb-common...
removing python...
removing guile2.0...
removing cmake...
removing shared-mime-info...
removing libxml2...
removing libuv...
removing jsoncpp...
==> ERROR: Build failed, check /chroot/x86_64/build/build