==> Creating clean working copy [build]...done
==> Making package: python2-rekall 1.6.0-1 (Thu Sep 21 14:28:15 EDT 2017)
==> Retrieving sources...
  -> Found rekall-1.6.0.zip
  -> Found LICENSE.txt
==> Validating source files with sha512sums...
    rekall-1.6.0.zip ... Passed
    LICENSE.txt ... Passed
==> Making package: python2-rekall 1.6.0-1 (Thu Sep 21 14:28:16 EDT 2017)
==> Checking runtime dependencies...
==> Installing missing dependencies...
resolving dependencies...
looking for conflicting packages...

Packages (1) python2-2.7.14-1

Total Download Size:   11.18 MiB
Total Installed Size:  72.32 MiB

:: Proceed with installation? [Y/n] 
:: Retrieving packages...
downloading python2-2.7.14-1-i686.pkg.tar.xz...
checking keyring...
checking package integrity...
loading package files...
checking for file conflicts...
checking available disk space...
:: Processing package changes...
installing python2...
Optional dependencies for python2
    tk: for IDLE
    python2-setuptools
    python2-pip
==> Checking buildtime dependencies...
==> Installing missing dependencies...
resolving dependencies...
looking for conflicting packages...

Packages (6) python2-appdirs-1.4.3-1  python2-packaging-16.8-2  python2-pyparsing-2.2.0-1  python2-six-1.11.0-1  python2-setuptools-1:36.5.0-1  python2-virtualenv-15.1.0-1

Total Download Size:   2.05 MiB
Total Installed Size:  4.48 MiB

:: Proceed with installation? [Y/n] 
:: Retrieving packages...
downloading python2-pyparsing-2.2.0-1-any.pkg.tar.xz...
downloading python2-six-1.11.0-1-any.pkg.tar.xz...
downloading python2-packaging-16.8-2-any.pkg.tar.xz...
downloading python2-appdirs-1.4.3-1-any.pkg.tar.xz...
downloading python2-setuptools-1:36.5.0-1-any.pkg.tar.xz...
downloading python2-virtualenv-15.1.0-1-any.pkg.tar.xz...
checking keyring...
checking package integrity...
loading package files...
checking for file conflicts...
checking available disk space...
:: Processing package changes...
installing python2-pyparsing...
installing python2-six...
installing python2-packaging...
installing python2-appdirs...
installing python2-setuptools...
installing python2-virtualenv...
==> Retrieving sources...
  -> Found rekall-1.6.0.zip
  -> Found LICENSE.txt
==> WARNING: Skipping verification of source file PGP signatures.
==> Validating source files with sha512sums...
    rekall-1.6.0.zip ... Passed
    LICENSE.txt ... Passed
==> Extracting sources...
  -> Extracting rekall-1.6.0.zip with bsdtar
==> Starting prepare()...
==> Starting build()...
running build
==> Entering fakeroot environment...
==> Starting package()...
New python executable in /build/python2-rekall/pkg/python2-rekall/usr/share/rekall/virtualenv/1.6.0-1/bin/python2
Also creating executable in /build/python2-rekall/pkg/python2-rekall/usr/share/rekall/virtualenv/1.6.0-1/bin/python
Installing setuptools, pip, wheel...done.
running install
running bdist_egg
running egg_info
writing requirements to rekall.egg-info/requires.txt
writing rekall.egg-info/PKG-INFO
writing top-level names to rekall.egg-info/top_level.txt
writing dependency_links to rekall.egg-info/dependency_links.txt
reading manifest file 'rekall.egg-info/SOURCES.txt'
reading manifest template 'MANIFEST.in'
warning: no files found matching '*' under directory 'test_data'
warning: no previously-included files matching '*.a' found under directory 'tools'
warning: no previously-included files matching '*.la' found under directory 'tools'
warning: no previously-included files matching '*.lo' found under directory 'tools'
warning: no previously-included files matching '*.o' found under directory 'tools'
warning: no previously-included files matching '*' found under directory '.git'
warning: no previously-included files matching '*' found under directory 'build'
warning: no previously-included files matching '*' found under directory 'tools/pmem/.deps'
warning: no previously-included files found matching 'tools/pmem/linpmem'
writing manifest file 'rekall.egg-info/SOURCES.txt'
installing library code to build/bdist.linux-x86_64/egg
running install_lib
warning: install_lib: 'build/lib' does not exist -- no Python modules to install

installing package data to build/bdist.linux-x86_64/egg
running install_data
creating build
creating build/bdist.linux-x86_64
creating build/bdist.linux-x86_64/egg
creating build/bdist.linux-x86_64/egg/tools
creating build/bdist.linux-x86_64/egg/tools/linux
copying tools/linux/README -> build/bdist.linux-x86_64/egg/tools/linux
copying tools/linux/Makefile -> build/bdist.linux-x86_64/egg/tools/linux
copying tools/linux/module.c -> build/bdist.linux-x86_64/egg/tools/linux
copying tools/linux/pmem.c -> build/bdist.linux-x86_64/egg/tools/linux
creating build/bdist.linux-x86_64/egg/EGG-INFO
copying rekall.egg-info/PKG-INFO -> build/bdist.linux-x86_64/egg/EGG-INFO
copying rekall.egg-info/SOURCES.txt -> build/bdist.linux-x86_64/egg/EGG-INFO
copying rekall.egg-info/dependency_links.txt -> build/bdist.linux-x86_64/egg/EGG-INFO
copying rekall.egg-info/requires.txt -> build/bdist.linux-x86_64/egg/EGG-INFO
copying rekall.egg-info/top_level.txt -> build/bdist.linux-x86_64/egg/EGG-INFO
zip_safe flag not set; analyzing archive contents...
creating dist
creating 'dist/rekall-1.6.0-py2.7.egg' and adding 'build/bdist.linux-x86_64/egg' to it
removing 'build/bdist.linux-x86_64/egg' (and everything under it)
Processing rekall-1.6.0-py2.7.egg
Copying rekall-1.6.0-py2.7.egg to /build/python2-rekall/pkg/python2-rekall/usr/share/rekall/virtualenv/1.6.0-1/lib/python2.7/site-packages
Adding rekall 1.6.0 to easy-install.pth file

Installed /build/python2-rekall/pkg/python2-rekall/usr/share/rekall/virtualenv/1.6.0-1/lib/python2.7/site-packages/rekall-1.6.0-py2.7.egg
Processing dependencies for rekall==1.6.0
Searching for readline
Reading https://pypi.python.org/simple/readline/
Downloading https://pypi.python.org/packages/f4/01/2cf081af8d880b44939a5f1b446551a7f8d59eae414277fd0c303757ff1b/readline-6.2.4.1.tar.gz#md5=578237939c81fdbc2c8334d168b17907
Best match: readline 6.2.4.1
Processing readline-6.2.4.1.tar.gz
Writing /tmp/easy_install-s6QJpy/readline-6.2.4.1/setup.cfg
Running readline-6.2.4.1/setup.py -q bdist_egg --dist-dir /tmp/easy_install-s6QJpy/readline-6.2.4.1/egg-dist-tmp-kYC7Fk
creating /build/python2-rekall/pkg/python2-rekall/usr/share/rekall/virtualenv/1.6.0-1/lib/python2.7/site-packages/readline-6.2.4.1-py2.7-linux-x86_64.egg
Extracting readline-6.2.4.1-py2.7-linux-x86_64.egg to /build/python2-rekall/pkg/python2-rekall/usr/share/rekall/virtualenv/1.6.0-1/lib/python2.7/site-packages
Adding readline 6.2.4.1 to easy-install.pth file

Installed /build/python2-rekall/pkg/python2-rekall/usr/share/rekall/virtualenv/1.6.0-1/lib/python2.7/site-packages/readline-6.2.4.1-py2.7-linux-x86_64.egg
Searching for ipython<6.0,>=5.0.0
Reading https://pypi.python.org/simple/ipython/
Downloading https://pypi.python.org/packages/14/7c/bbc1e749e1739208324af3f05ac7256985e21fc5f24d3c8da20aae844ad0/ipython-5.5.0.tar.gz#md5=61f627b9365f630887beb30a002f76fd
Best match: ipython 5.5.0
Processing ipython-5.5.0.tar.gz
Writing /tmp/easy_install-wSNgOn/ipython-5.5.0/setup.cfg
Running ipython-5.5.0/setup.py -q bdist_egg --dist-dir /tmp/easy_install-wSNgOn/ipython-5.5.0/egg-dist-tmp-KatE8m
checking package data
check version number
creating /build/python2-rekall/pkg/python2-rekall/usr/share/rekall/virtualenv/1.6.0-1/lib/python2.7/site-packages/ipython-5.5.0-py2.7.egg
Extracting ipython-5.5.0-py2.7.egg to /build/python2-rekall/pkg/python2-rekall/usr/share/rekall/virtualenv/1.6.0-1/lib/python2.7/site-packages
Adding ipython 5.5.0 to easy-install.pth file
Installing ipython script to /build/python2-rekall/pkg/python2-rekall/usr/share/rekall/virtualenv/1.6.0-1/bin
Installing iptest2 script to /build/python2-rekall/pkg/python2-rekall/usr/share/rekall/virtualenv/1.6.0-1/bin
Installing iptest script to /build/python2-rekall/pkg/python2-rekall/usr/share/rekall/virtualenv/1.6.0-1/bin
Installing ipython2 script to /build/python2-rekall/pkg/python2-rekall/usr/share/rekall/virtualenv/1.6.0-1/bin

Installed /build/python2-rekall/pkg/python2-rekall/usr/share/rekall/virtualenv/1.6.0-1/lib/python2.7/site-packages/ipython-5.5.0-py2.7.egg
Searching for rekall-core>=1.5.0
Reading https://pypi.python.org/simple/rekall-core/
Downloading https://pypi.python.org/packages/50/46/1b3d42beb4d100b4981d41a948312fea1bc5d6c6373fcfc677c636f33e42/rekall-core-1.6.0.zip#md5=e48f1e2c776808a27deaae5717e21513
Best match: rekall-core 1.6.0
Processing rekall-core-1.6.0.zip
Writing /tmp/easy_install-bWoQgd/rekall-core-1.6.0/setup.cfg
Running rekall-core-1.6.0/setup.py -q bdist_egg --dist-dir /tmp/easy_install-bWoQgd/rekall-core-1.6.0/egg-dist-tmp-mb_dgW
warning: no previously-included files matching '*' found under directory '.git'
warning: no previously-included files matching '*' found under directory 'build'
warning: no previously-included files matching '*.pyc' found under directory 'rekall'
warning: no previously-included files matching '*.a' found under directory 'tools'
warning: no previously-included files matching '*.la' found under directory 'tools'
warning: no previously-included files matching '*.lo' found under directory 'tools'
warning: no previously-included files matching '*.o' found under directory 'tools'
warning: no previously-included files found matching '.gitignore'
warning: no previously-included files found matching '*.pyc'
zip_safe flag not set; analyzing archive contents...
rekall._version: module references __file__
rekall.interactive: module MAY be using inspect.stack
creating /build/python2-rekall/pkg/python2-rekall/usr/share/rekall/virtualenv/1.6.0-1/lib/python2.7/site-packages/rekall_core-1.6.0-py2.7.egg
Extracting rekall_core-1.6.0-py2.7.egg to /build/python2-rekall/pkg/python2-rekall/usr/share/rekall/virtualenv/1.6.0-1/lib/python2.7/site-packages
Adding rekall-core 1.6.0 to easy-install.pth file
Installing rekal.py script to /build/python2-rekall/pkg/python2-rekall/usr/share/rekall/virtualenv/1.6.0-1/bin
Installing rekall script to /build/python2-rekall/pkg/python2-rekall/usr/share/rekall/virtualenv/1.6.0-1/bin
Installing rekal script to /build/python2-rekall/pkg/python2-rekall/usr/share/rekall/virtualenv/1.6.0-1/bin

Installed /build/python2-rekall/pkg/python2-rekall/usr/share/rekall/virtualenv/1.6.0-1/lib/python2.7/site-packages/rekall_core-1.6.0-py2.7.egg
Searching for pexpect
Reading https://pypi.python.org/simple/pexpect/
Downloading https://pypi.python.org/packages/e8/13/d0b0599099d6cd23663043a2a0bb7c61e58c6ba359b2656e6fb000ef5b98/pexpect-4.2.1.tar.gz#md5=3694410001a99dff83f0b500a1ca1c95
Best match: pexpect 4.2.1
Processing pexpect-4.2.1.tar.gz
Writing /tmp/easy_install-f5RCbR/pexpect-4.2.1/setup.cfg
Running pexpect-4.2.1/setup.py -q bdist_egg --dist-dir /tmp/easy_install-f5RCbR/pexpect-4.2.1/egg-dist-tmp-D_lP7i
  File "build/bdist.linux-x86_64/egg/pexpect/async.py", line 16
    transport, pw = yield from asyncio.get_event_loop()\
                             ^
SyntaxError: invalid syntax

zip_safe flag not set; analyzing archive contents...
pexpect.replwrap: module references __file__
creating /build/python2-rekall/pkg/python2-rekall/usr/share/rekall/virtualenv/1.6.0-1/lib/python2.7/site-packages/pexpect-4.2.1-py2.7.egg
Extracting pexpect-4.2.1-py2.7.egg to /build/python2-rekall/pkg/python2-rekall/usr/share/rekall/virtualenv/1.6.0-1/lib/python2.7/site-packages
  File "/build/python2-rekall/pkg/python2-rekall/usr/share/rekall/virtualenv/1.6.0-1/lib/python2.7/site-packages/pexpect-4.2.1-py2.7.egg/pexpect/async.py", line 16
    transport, pw = yield from asyncio.get_event_loop()\
                             ^
SyntaxError: invalid syntax

  File "/build/python2-rekall/pkg/python2-rekall/usr/share/rekall/virtualenv/1.6.0-1/lib/python2.7/site-packages/pexpect-4.2.1-py2.7.egg/pexpect/async.py", line 16
    transport, pw = yield from asyncio.get_event_loop()\
                             ^
SyntaxError: invalid syntax

Adding pexpect 4.2.1 to easy-install.pth file

Installed /build/python2-rekall/pkg/python2-rekall/usr/share/rekall/virtualenv/1.6.0-1/lib/python2.7/site-packages/pexpect-4.2.1-py2.7.egg
Searching for pathlib2
Reading https://pypi.python.org/simple/pathlib2/
Downloading https://pypi.python.org/packages/a1/14/df0deb867c2733f7d857523c10942b3d6612a1b222502fdffa9439943dfb/pathlib2-2.3.0.tar.gz#md5=89c90409d11fd5947966b6a30a47d18c
Best match: pathlib2 2.3.0
Processing pathlib2-2.3.0.tar.gz
Writing /tmp/easy_install-p821DR/pathlib2-2.3.0/setup.cfg
Running pathlib2-2.3.0/setup.py -q bdist_egg --dist-dir /tmp/easy_install-p821DR/pathlib2-2.3.0/egg-dist-tmp-WAJj2C
warning: no previously-included files found matching '.travis.yml'
warning: no previously-included files found matching 'appveyor.yml'
warning: no previously-included files found matching 'codecov.yml'
no previously-included directories found matching 'appveyor'
zip_safe flag not set; analyzing archive contents...
Moving pathlib2-2.3.0-py2.7.egg to /build/python2-rekall/pkg/python2-rekall/usr/share/rekall/virtualenv/1.6.0-1/lib/python2.7/site-packages
Adding pathlib2 2.3.0 to easy-install.pth file

Installed /build/python2-rekall/pkg/python2-rekall/usr/share/rekall/virtualenv/1.6.0-1/lib/python2.7/site-packages/pathlib2-2.3.0-py2.7.egg
Searching for backports.shutil_get_terminal_size
Reading https://pypi.python.org/simple/backports.shutil_get_terminal_size/
Downloading https://pypi.python.org/packages/ec/9c/368086faa9c016efce5da3e0e13ba392c9db79e3ab740b763fe28620b18b/backports.shutil_get_terminal_size-1.0.0.tar.gz#md5=03267762480bd86b50580dc19dff3c66
Best match: backports.shutil-get-terminal-size 1.0.0
Processing backports.shutil_get_terminal_size-1.0.0.tar.gz
Writing /tmp/easy_install-rMBgKq/backports.shutil_get_terminal_size-1.0.0/setup.cfg
Running backports.shutil_get_terminal_size-1.0.0/setup.py -q bdist_egg --dist-dir /tmp/easy_install-rMBgKq/backports.shutil_get_terminal_size-1.0.0/egg-dist-tmp-2cz_sv
zip_safe flag not set; analyzing archive contents...
backports.__init__: module references __path__
creating /build/python2-rekall/pkg/python2-rekall/usr/share/rekall/virtualenv/1.6.0-1/lib/python2.7/site-packages/backports.shutil_get_terminal_size-1.0.0-py2.7.egg
Extracting backports.shutil_get_terminal_size-1.0.0-py2.7.egg to /build/python2-rekall/pkg/python2-rekall/usr/share/rekall/virtualenv/1.6.0-1/lib/python2.7/site-packages
Adding backports.shutil-get-terminal-size 1.0.0 to easy-install.pth file

Installed /build/python2-rekall/pkg/python2-rekall/usr/share/rekall/virtualenv/1.6.0-1/lib/python2.7/site-packages/backports.shutil_get_terminal_size-1.0.0-py2.7.egg
Searching for pygments
Reading https://pypi.python.org/simple/pygments/
Downloading https://pypi.python.org/packages/71/2a/2e4e77803a8bd6408a2903340ac498cb0a2181811af7c9ec92cb70b0308a/Pygments-2.2.0.tar.gz#md5=13037baca42f16917cbd5ad2fab50844
Best match: Pygments 2.2.0
Processing Pygments-2.2.0.tar.gz
Writing /tmp/easy_install-nRfD5F/Pygments-2.2.0/setup.cfg
Running Pygments-2.2.0/setup.py -q bdist_egg --dist-dir /tmp/easy_install-nRfD5F/Pygments-2.2.0/egg-dist-tmp-wTd2ub
creating /build/python2-rekall/pkg/python2-rekall/usr/share/rekall/virtualenv/1.6.0-1/lib/python2.7/site-packages/Pygments-2.2.0-py2.7.egg
Extracting Pygments-2.2.0-py2.7.egg to /build/python2-rekall/pkg/python2-rekall/usr/share/rekall/virtualenv/1.6.0-1/lib/python2.7/site-packages
Adding Pygments 2.2.0 to easy-install.pth file
Installing pygmentize script to /build/python2-rekall/pkg/python2-rekall/usr/share/rekall/virtualenv/1.6.0-1/bin

Installed /build/python2-rekall/pkg/python2-rekall/usr/share/rekall/virtualenv/1.6.0-1/lib/python2.7/site-packages/Pygments-2.2.0-py2.7.egg
Searching for prompt_toolkit<2.0.0,>=1.0.4
Reading https://pypi.python.org/simple/prompt_toolkit/
Downloading https://pypi.python.org/packages/8a/ad/cf6b128866e78ad6d7f1dc5b7f99885fb813393d9860778b2984582e81b5/prompt_toolkit-1.0.15.tar.gz#md5=8fe70295006dbc8afedd43e5eba99032
Best match: prompt-toolkit 1.0.15
Processing prompt_toolkit-1.0.15.tar.gz
Writing /tmp/easy_install-cR8lZq/prompt_toolkit-1.0.15/setup.cfg
Running prompt_toolkit-1.0.15/setup.py -q bdist_egg --dist-dir /tmp/easy_install-cR8lZq/prompt_toolkit-1.0.15/egg-dist-tmp-5Y_FU6
no previously-included directories found matching 'examples/sample?/build'
zip_safe flag not set; analyzing archive contents...
Moving prompt_toolkit-1.0.15-py2.7.egg to /build/python2-rekall/pkg/python2-rekall/usr/share/rekall/virtualenv/1.6.0-1/lib/python2.7/site-packages
Adding prompt-toolkit 1.0.15 to easy-install.pth file

Installed /build/python2-rekall/pkg/python2-rekall/usr/share/rekall/virtualenv/1.6.0-1/lib/python2.7/site-packages/prompt_toolkit-1.0.15-py2.7.egg
Searching for traitlets>=4.2
Reading https://pypi.python.org/simple/traitlets/
Downloading https://pypi.python.org/packages/a5/98/7f5ef2fe9e9e071813aaf9cb91d1a732e0a68b6c44a32b38cb8e14c3f069/traitlets-4.3.2.tar.gz#md5=3068663f2f38fd939a9eb3a500ccc154
Best match: traitlets 4.3.2
Processing traitlets-4.3.2.tar.gz
Writing /tmp/easy_install-mfYwAd/traitlets-4.3.2/setup.cfg
Running traitlets-4.3.2/setup.py -q bdist_egg --dist-dir /tmp/easy_install-mfYwAd/traitlets-4.3.2/egg-dist-tmp-qjGsj6
zip_safe flag not set; analyzing archive contents...
traitlets.traitlets: module MAY be using inspect.getsourcefile
traitlets.config.loader: module references __file__
traitlets.tests._warnings: module MAY be using inspect.getouterframes
creating /build/python2-rekall/pkg/python2-rekall/usr/share/rekall/virtualenv/1.6.0-1/lib/python2.7/site-packages/traitlets-4.3.2-py2.7.egg
Extracting traitlets-4.3.2-py2.7.egg to /build/python2-rekall/pkg/python2-rekall/usr/share/rekall/virtualenv/1.6.0-1/lib/python2.7/site-packages
Adding traitlets 4.3.2 to easy-install.pth file

Installed /build/python2-rekall/pkg/python2-rekall/usr/share/rekall/virtualenv/1.6.0-1/lib/python2.7/site-packages/traitlets-4.3.2-py2.7.egg
Searching for simplegeneric>0.8
Reading https://pypi.python.org/simple/simplegeneric/
Downloading https://pypi.python.org/packages/3d/57/4d9c9e3ae9a255cd4e1106bb57e24056d3d0709fc01b2e3e345898e49d5b/simplegeneric-0.8.1.zip#md5=f9c1fab00fd981be588fc32759f474e3
Best match: simplegeneric 0.8.1
Processing simplegeneric-0.8.1.zip
Writing /tmp/easy_install-7zJyWx/simplegeneric-0.8.1/setup.cfg
Running simplegeneric-0.8.1/setup.py -q bdist_egg --dist-dir /tmp/easy_install-7zJyWx/simplegeneric-0.8.1/egg-dist-tmp-tleYwK
zip_safe flag not set; analyzing archive contents...
Moving simplegeneric-0.8.1-py2.7.egg to /build/python2-rekall/pkg/python2-rekall/usr/share/rekall/virtualenv/1.6.0-1/lib/python2.7/site-packages
Adding simplegeneric 0.8.1 to easy-install.pth file

Installed /build/python2-rekall/pkg/python2-rekall/usr/share/rekall/virtualenv/1.6.0-1/lib/python2.7/site-packages/simplegeneric-0.8.1-py2.7.egg
Searching for pickleshare
Reading https://pypi.python.org/simple/pickleshare/
Downloading https://pypi.python.org/packages/69/fe/dd137d84daa0fd13a709e448138e310d9ea93070620c9db5454e234af525/pickleshare-0.7.4.tar.gz#md5=6a9e5dd8dfc023031f6b7b3f824cab12
Best match: pickleshare 0.7.4
Processing pickleshare-0.7.4.tar.gz
Writing /tmp/easy_install-0u01vY/pickleshare-0.7.4/setup.cfg
Running pickleshare-0.7.4/setup.py -q bdist_egg --dist-dir /tmp/easy_install-0u01vY/pickleshare-0.7.4/egg-dist-tmp-dh22ga
zip_safe flag not set; analyzing archive contents...
Moving pickleshare-0.7.4-py2.7.egg to /build/python2-rekall/pkg/python2-rekall/usr/share/rekall/virtualenv/1.6.0-1/lib/python2.7/site-packages
Adding pickleshare 0.7.4 to easy-install.pth file

Installed /build/python2-rekall/pkg/python2-rekall/usr/share/rekall/virtualenv/1.6.0-1/lib/python2.7/site-packages/pickleshare-0.7.4-py2.7.egg
Searching for decorator
Reading https://pypi.python.org/simple/decorator/
Downloading https://pypi.python.org/packages/bb/e0/f6e41e9091e130bf16d4437dabbac3993908e4d6485ecbc985ef1352db94/decorator-4.1.2.tar.gz#md5=a0f7f4fe00ae2dde93494d90c192cf8c
Best match: decorator 4.1.2
Processing decorator-4.1.2.tar.gz
Writing /tmp/easy_install-NpdqT_/decorator-4.1.2/setup.cfg
Running decorator-4.1.2/setup.py -q bdist_egg --dist-dir /tmp/easy_install-NpdqT_/decorator-4.1.2/egg-dist-tmp-R0ask1
warning: no files found matching 'documentation.pdf'
creating /build/python2-rekall/pkg/python2-rekall/usr/share/rekall/virtualenv/1.6.0-1/lib/python2.7/site-packages/decorator-4.1.2-py2.7.egg
Extracting decorator-4.1.2-py2.7.egg to /build/python2-rekall/pkg/python2-rekall/usr/share/rekall/virtualenv/1.6.0-1/lib/python2.7/site-packages
Adding decorator 4.1.2 to easy-install.pth file

Installed /build/python2-rekall/pkg/python2-rekall/usr/share/rekall/virtualenv/1.6.0-1/lib/python2.7/site-packages/decorator-4.1.2-py2.7.egg
Searching for python-dateutil==2.5.3
Reading https://pypi.python.org/simple/python-dateutil/
Downloading https://pypi.python.org/packages/b7/9f/ba2b6aaf27e74df59f31b77d1927d5b037cc79a89cda604071f93d289eaf/python-dateutil-2.5.3.zip#md5=52b3f339f41986c25c3a2247e722db17
Best match: python-dateutil 2.5.3
Processing python-dateutil-2.5.3.zip
Writing /tmp/easy_install-uQ76da/python-dateutil-2.5.3/setup.cfg
Running python-dateutil-2.5.3/setup.py -q bdist_egg --dist-dir /tmp/easy_install-uQ76da/python-dateutil-2.5.3/egg-dist-tmp-i4JjuU
warning: no previously-included files matching '__pycache__' found anywhere in distribution
warning: no previously-included files matching '*.py[co]' found anywhere in distribution
Moving python_dateutil-2.5.3-py2.7.egg to /build/python2-rekall/pkg/python2-rekall/usr/share/rekall/virtualenv/1.6.0-1/lib/python2.7/site-packages
Adding python-dateutil 2.5.3 to easy-install.pth file

Installed /build/python2-rekall/pkg/python2-rekall/usr/share/rekall/virtualenv/1.6.0-1/lib/python2.7/site-packages/python_dateutil-2.5.3-py2.7.egg
Searching for ipaddr==2.1.11
Reading https://pypi.python.org/simple/ipaddr/
Downloading https://pypi.python.org/packages/08/80/7539938aca4901864b7767a23eb6861fac18ef5219b60257fc938dae3568/ipaddr-2.1.11.tar.gz#md5=f2c7852f95862715f92e7d089dc3f2cf
Best match: ipaddr 2.1.11
Processing ipaddr-2.1.11.tar.gz
Writing /tmp/easy_install-k4sR39/ipaddr-2.1.11/setup.cfg
Running ipaddr-2.1.11/setup.py -q bdist_egg --dist-dir /tmp/easy_install-k4sR39/ipaddr-2.1.11/egg-dist-tmp-NPQZso
zip_safe flag not set; analyzing archive contents...
Moving ipaddr-2.1.11-py2.7.egg to /build/python2-rekall/pkg/python2-rekall/usr/share/rekall/virtualenv/1.6.0-1/lib/python2.7/site-packages
Adding ipaddr 2.1.11 to easy-install.pth file

Installed /build/python2-rekall/pkg/python2-rekall/usr/share/rekall/virtualenv/1.6.0-1/lib/python2.7/site-packages/ipaddr-2.1.11-py2.7.egg
Searching for pytsk3==20160721
Reading https://pypi.python.org/simple/pytsk3/
Downloading https://pypi.python.org/packages/5e/da/2eaffe04679209e1a4ba6882c6c6837410be7fdc7e3ea1832055c0598b8b/pytsk3-20160721.tar.gz#md5=9b2f263238a871237f84fe8dcfbd4932
Best match: pytsk3 20160721
Processing pytsk3-20160721.tar.gz
Writing /tmp/easy_install-x8S4MM/pytsk3-20160721/setup.cfg
Running pytsk3-20160721/setup.py -q bdist_egg --dist-dir /tmp/easy_install-x8S4MM/pytsk3-20160721/egg-dist-tmp-tr0Jnj
warning: no previously-included files matching '*' found under directory 'test_data'
warning: no previously-included files matching '*' found under directory 'sleuthkit/bindings'
warning: no previously-included files matching '*' found under directory 'sleuthkit/autom4te.cache'
warning: no previously-included files matching '*' found under directory 'sleuthkit/framework'
warning: no previously-included files matching '*' found under directory 'sleuthkit/man'
warning: no previously-included files matching '*' found under directory 'sleuthkit/packages'
warning: no previously-included files matching '*' found under directory 'sleuthkit/release'
warning: no previously-included files matching '*' found under directory 'sleuthkit/samples'
warning: no previously-included files matching '*' found under directory 'sleuthkit/tests'
warning: no previously-included files matching '*' found under directory 'sleuthkit/tools'
warning: no previously-included files matching '*' found under directory 'sleuthkit/unit_tests'
warning: no previously-included files matching '*' found under directory 'sleuthkit/win32'
warning: no previously-included files matching '*' found under directory 'sleuthkit/xcode'
sed: can't read config/ltmain.sh: No such file or directory
sed: can't read libtoolT: No such file or directory
sleuthkit/tsk/auto/db_sqlite.cpp:515:27: warning: invalid suffix on literal; C++11 requires a space between literal and string macro [-Wliteral-suffix]
     sql = sqlite3_mprintf("INSERT INTO tsk_image_info (obj_id, type, ssize, tzone, size, md5) VALUES (%lld, %d, %d, '%q', %"PRIuOFF", '%q');",
                           ^
sleuthkit/tsk/auto/db_sqlite.cpp:1109:34: warning: invalid suffix on literal; C++11 requires a space between literal and string macro [-Wliteral-suffix]
         snprintf(fsObjIdStr, 32, "%"PRIu64, fsObjId);
                                  ^
sleuthkit/tsk/auto/db_sqlite.cpp:1493:34: warning: invalid suffix on literal; C++11 requires a space between literal and string macro [-Wliteral-suffix]
             tsk_error_set_errstr("Error finding parent for: %"PRIu64, fsObjId);
                                  ^
sleuthkit/tsk/auto/db_sqlite.cpp:1546:34: warning: invalid suffix on literal; C++11 requires a space between literal and string macro [-Wliteral-suffix]
             tsk_error_set_errstr("Error finding parent for: %"PRIu64, vsObjId);
                                  ^
sleuthkit/tsk/auto/db_sqlite.cpp:1596:34: warning: invalid suffix on literal; C++11 requires a space between literal and string macro [-Wliteral-suffix]
             tsk_error_set_errstr("Error finding parent for: %"PRIu64, vsPartObjId);
                                  ^
sleuthkit/tsk/auto/db_sqlite.cpp: In member function 'int64_t TskDbSqlite::findParObjId(const TSK_FS_FILE*, const char*, const int64_t&)':
sleuthkit/tsk/auto/db_sqlite.cpp:798:25: warning: ISO C++ forbids converting a string constant to 'char*' [-Wwrite-strings]
     char *parent_name = "";
                         ^~
sleuthkit/tsk/auto/db_sqlite.cpp:799:25: warning: ISO C++ forbids converting a string constant to 'char*' [-Wwrite-strings]
     char *parent_path = "";
                         ^~
sleuthkit/tsk/auto/auto_db.cpp:853:31: warning: invalid suffix on literal; C++11 requires a space between literal and string macro [-Wliteral-suffix]
         tsk_error_set_errstr2("TskAutoDb::addFsInfoUnalloc: error opening fs at offset %"PRIuOFF, dbFsInfo.imgOffset);
                               ^
sleuthkit/tsk/auto/tsk_db.cpp: In member function 'virtual bool TskDb::getParentPathAndName(const char*, char**, char**)':
sleuthkit/tsk/auto/tsk_db.cpp:64:28: warning: ISO C++ forbids converting a string constant to 'char*' [-Wwrite-strings]
         *ret_parent_path = "";
                            ^~
sleuthkit/tsk/auto/tsk_db.cpp:65:21: warning: ISO C++ forbids converting a string constant to 'char*' [-Wwrite-strings]
         *ret_name = "";
                     ^~
sleuthkit/tsk/auto/tsk_db.cpp:71:21: warning: ISO C++ forbids converting a string constant to 'char*' [-Wwrite-strings]
         *ret_name = "";
                     ^~
sleuthkit/tsk/auto/tsk_db.cpp:72:28: warning: ISO C++ forbids converting a string constant to 'char*' [-Wwrite-strings]
         *ret_parent_path = "/";
                            ^~~
sleuthkit/tsk/auto/tsk_db.cpp:93:16: warning: ISO C++ forbids converting a string constant to 'char*' [-Wwrite-strings]
     char *ch = "/";
                ^~~
sleuthkit/tsk/auto/tsk_db.cpp:106:28: warning: ISO C++ forbids converting a string constant to 'char*' [-Wwrite-strings]
         *ret_parent_path = "/";
                            ^~~
sleuthkit/tsk/fs/ext2fs.c: In function 'ext2fs_fsstat':
sleuthkit/tsk/fs/ext2fs.c:1909:28: warning: comparison between pointer and zero character constant [-Wpointer-compare]
     if (sb->s_last_mounted != '\0')
                            ^~
sleuthkit/tsk/fs/ext2fs.c:1909:9: note: did you mean to dereference the pointer?
     if (sb->s_last_mounted != '\0')
         ^
sleuthkit/tsk/fs/iso9660.c: In function 'iso9660_inode_walk':
sleuthkit/tsk/fs/iso9660.c:1224:33: warning: cast from pointer to integer of different size [-Wpointer-to-int-cast]
             start, last, flags, (uint64_t) action, (uint64_t) ptr);
                                 ^
sleuthkit/tsk/fs/iso9660.c:1224:52: warning: cast from pointer to integer of different size [-Wpointer-to-int-cast]
             start, last, flags, (uint64_t) action, (uint64_t) ptr);
                                                    ^
sleuthkit/tsk/fs/iso9660.c: In function 'iso9660_block_walk':
sleuthkit/tsk/fs/iso9660.c:1432:33: warning: cast from pointer to integer of different size [-Wpointer-to-int-cast]
             start, last, flags, (uint64_t) action, (uint64_t) ptr);
                                 ^
sleuthkit/tsk/fs/iso9660.c:1432:52: warning: cast from pointer to integer of different size [-Wpointer-to-int-cast]
             start, last, flags, (uint64_t) action, (uint64_t) ptr);
                                                    ^
sleuthkit/tsk/fs/iso9660.c: In function 'make_unix_perm':
sleuthkit/tsk/fs/iso9660.c:1885:35: warning: cast from pointer to integer of different size [-Wpointer-to-int-cast]
             " dd: %" PRIu64 "\n", (uint64_t) fs, (uint64_t) dd);
                                   ^
sleuthkit/tsk/fs/iso9660.c:1885:50: warning: cast from pointer to integer of different size [-Wpointer-to-int-cast]
             " dd: %" PRIu64 "\n", (uint64_t) fs, (uint64_t) dd);
                                                  ^
sleuthkit/tsk/fs/iso9660.c: In function 'iso9660_open':
sleuthkit/tsk/fs/iso9660.c:2492:54: warning: cast from pointer to integer of different size [-Wpointer-to-int-cast]
             " ftype: %" PRIu8 " test: %" PRIu8 "\n", (uint64_t) img_info,
                                                      ^
sleuthkit/tsk/fs/yaffs.cpp: In function 'uint8_t yaffs_make_deleted(YAFFSFS_INFO*, TSK_FS_FILE*)':
sleuthkit/tsk/fs/yaffs.cpp:1745:95: warning: ISO C++ forbids converting a string constant to 'char*' [-Wwrite-strings]
     if (yaffs_make_directory(yaffsfs, fs_file, YAFFS_OBJECT_DELETED, YAFFS_OBJECT_DELETED_NAME))
                                                                                               ^
sleuthkit/tsk/fs/yaffs.cpp: In function 'uint8_t yaffs_make_unlinked(YAFFSFS_INFO*, TSK_FS_FILE*)':
sleuthkit/tsk/fs/yaffs.cpp:1767:97: warning: ISO C++ forbids converting a string constant to 'char*' [-Wwrite-strings]
     if (yaffs_make_directory(yaffsfs, fs_file, YAFFS_OBJECT_UNLINKED, YAFFS_OBJECT_UNLINKED_NAME))
                                                                                                 ^
In file included from sleuthkit/tsk/fs/yaffs.cpp:38:0:
sleuthkit/tsk/fs/yaffs.cpp: In function 'uint8_t yaffs_inode_lookup(TSK_FS_INFO*, TSK_FS_FILE*, TSK_INUM_T)':
sleuthkit/tsk/fs/tsk_yaffs.h:158:42: warning: ISO C++ forbids converting a string constant to 'char*' [-Wwrite-strings]
 #define YAFFS_OBJECT_LOSTNFOUND_NAME     "lost+found"
                                          ^
sleuthkit/tsk/fs/yaffs.cpp:1878:21: note: in expansion of macro 'YAFFS_OBJECT_LOSTNFOUND_NAME'
         real_name = YAFFS_OBJECT_LOSTNFOUND_NAME;
                     ^~~~~~~~~~~~~~~~~~~~~~~~~~~~
sleuthkit/tsk/fs/tsk_yaffs.h:159:42: warning: ISO C++ forbids converting a string constant to 'char*' [-Wwrite-strings]
 #define YAFFS_OBJECT_UNLINKED_NAME       "<unlinked>"
                                          ^
sleuthkit/tsk/fs/yaffs.cpp:1881:21: note: in expansion of macro 'YAFFS_OBJECT_UNLINKED_NAME'
         real_name = YAFFS_OBJECT_UNLINKED_NAME;
                     ^~~~~~~~~~~~~~~~~~~~~~~~~~
sleuthkit/tsk/fs/tsk_yaffs.h:160:42: warning: ISO C++ forbids converting a string constant to 'char*' [-Wwrite-strings]
 #define YAFFS_OBJECT_DELETED_NAME        "<deleted>"
                                          ^
sleuthkit/tsk/fs/yaffs.cpp:1884:21: note: in expansion of macro 'YAFFS_OBJECT_DELETED_NAME'
         real_name = YAFFS_OBJECT_DELETED_NAME;
                     ^~~~~~~~~~~~~~~~~~~~~~~~~
sleuthkit/tsk/hashdb/sqlite_hdb.cpp:417:30: warning: invalid suffix on literal; C++11 requires a space between literal and string macro [-Wliteral-suffix]
         tsk_error_set_errstr("sqlite_hdb_add_entry: md5 length incorrect (=%"PRIuSIZE")", md5_str_len);
                              ^
sleuthkit/tsk/hashdb/sqlite_hdb.cpp:494:30: warning: invalid suffix on literal; C++11 requires a space between literal and string macro [-Wliteral-suffix]
         tsk_error_set_errstr("sqlite_hdb_lookup_str: hash length incorrect (=%"PRIuSIZE"), expecting %d", len, TSK_HDB_HTYPE_MD5_LEN);
                              ^
sleuthkit/tsk/hashdb/sqlite_hdb.cpp:528:30: warning: invalid suffix on literal; C++11 requires a space between literal and string macro [-Wliteral-suffix]
         tsk_error_set_errstr("sqlite_hdb_lookup_bin: len=%"PRIu8", expected %"PRIuSIZE, len, MD5_BLOB_LEN);
                              ^
sleuthkit/tsk/hashdb/sqlite_hdb.cpp:528:65: warning: invalid suffix on literal; C++11 requires a space between literal and string macro [-Wliteral-suffix]
         tsk_error_set_errstr("sqlite_hdb_lookup_bin: len=%"PRIu8", expected %"PRIuSIZE, len, MD5_BLOB_LEN);
                                                                 ^
sleuthkit/tsk/hashdb/sqlite_hdb.cpp:598:30: warning: invalid suffix on literal; C++11 requires a space between literal and string macro [-Wliteral-suffix]
         tsk_error_set_errstr("sqlite_hdb_lookup_verbose_str: hash length incorrect (=%"PRIuSIZE"), expecting %d", len, TSK_HDB_HTYPE_MD5_LEN);
                              ^
sleuthkit/tsk/hashdb/binsrch_index.cpp:252:17: warning: invalid suffix on literal; C++11 requires a space between literal and string macro [-Wliteral-suffix]
                 "%s: error opening index of index: %"PRIttocTSK,
                 ^
sleuthkit/tsk/hashdb/binsrch_index.cpp:855:13: warning: invalid suffix on literal; C++11 requires a space between literal and string macro [-Wliteral-suffix]
             "%s: error creating index of index file %"PRIttocTSK,
             ^
sleuthkit/tsk/img/img_open.c: In function 'tsk_img_get_names':
sleuthkit/tsk/img/img_open.c:594:32: warning: return from incompatible pointer type [-Wincompatible-pointer-types]
                 return raw_info->images;
                        ~~~~~~~~^~~~~~~~
configure:
Building:
   afflib support:                        no
   libewf support:                        no
   zlib support:                          no

Features:
   Java/JNI support:                      no
   Multithreading:                        yes


creating /build/python2-rekall/pkg/python2-rekall/usr/share/rekall/virtualenv/1.6.0-1/lib/python2.7/site-packages/pytsk3-20160721-py2.7-linux-x86_64.egg
Extracting pytsk3-20160721-py2.7-linux-x86_64.egg to /build/python2-rekall/pkg/python2-rekall/usr/share/rekall/virtualenv/1.6.0-1/lib/python2.7/site-packages
Adding pytsk3 20160721 to easy-install.pth file

Installed /build/python2-rekall/pkg/python2-rekall/usr/share/rekall/virtualenv/1.6.0-1/lib/python2.7/site-packages/pytsk3-20160721-py2.7-linux-x86_64.egg
Searching for sortedcontainers==1.4.4
Reading https://pypi.python.org/simple/sortedcontainers/
Downloading https://pypi.python.org/packages/5c/7d/701fcd61d95cfe850a9aac64fb75131f2f2bf60c0f7a3ad8838c15c82140/sortedcontainers-1.4.4.tar.gz#md5=456638aea9f8f705bd2e3c891c402023
Best match: sortedcontainers 1.4.4
Processing sortedcontainers-1.4.4.tar.gz
Writing /tmp/easy_install-wrAaKf/sortedcontainers-1.4.4/setup.cfg
Running sortedcontainers-1.4.4/setup.py -q bdist_egg --dist-dir /tmp/easy_install-wrAaKf/sortedcontainers-1.4.4/egg-dist-tmp-lTCt9C
zip_safe flag not set; analyzing archive contents...
Moving sortedcontainers-1.4.4-py2.7.egg to /build/python2-rekall/pkg/python2-rekall/usr/share/rekall/virtualenv/1.6.0-1/lib/python2.7/site-packages
Adding sortedcontainers 1.4.4 to easy-install.pth file

Installed /build/python2-rekall/pkg/python2-rekall/usr/share/rekall/virtualenv/1.6.0-1/lib/python2.7/site-packages/sortedcontainers-1.4.4-py2.7.egg
Searching for rekall-yara==3.4.0.1
Reading https://pypi.python.org/simple/rekall-yara/
Downloading https://pypi.python.org/packages/04/a8/663d0d6243e9c075de06935ff97344a686980a845199035881a4b4efc4b6/rekall_yara-3.4.0.1.tar.gz#md5=13b9b7c00e999fdb9bd50fb8ba9e7fe3
Best match: rekall-yara 3.4.0.1
Processing rekall_yara-3.4.0.1.tar.gz
Writing /tmp/easy_install-A9_Jxp/rekall_yara-3.4.0.1/setup.cfg
Running rekall_yara-3.4.0.1/setup.py -q bdist_egg --dist-dir /tmp/easy_install-A9_Jxp/rekall_yara-3.4.0.1/egg-dist-tmp-HCGr8n
no previously-included directories found matching 'rekall_yara/yara/windows'
no previously-included directories found matching 'rekall_yara/yara/docs'
no previously-included directories found matching 'rekall_yara/yara/tests'
checking for a BSD-compatible install... /usr/bin/install -c
checking whether build environment is sane... yes
checking for a thread-safe mkdir -p... /usr/bin/mkdir -p
checking for gawk... gawk
checking whether make sets $(MAKE)... yes
checking whether make supports nested variables... yes
checking for style of include used by make... GNU
checking for gcc... gcc
checking whether the C compiler works... yes
checking for C compiler default output file name... a.out
checking for suffix of executables... 
checking whether we are cross compiling... no
checking for suffix of object files... o
checking whether we are using the GNU C compiler... yes
checking whether gcc accepts -g... yes
checking for gcc option to accept ISO C89... none needed
checking whether gcc understands -c and -o together... yes
checking dependency style of gcc... gcc3
checking for ar... ar
checking the archiver (ar) interface... ar
checking for gcc... (cached) gcc
checking whether we are using the GNU C compiler... (cached) yes
checking whether gcc accepts -g... (cached) yes
checking for gcc option to accept ISO C89... (cached) none needed
checking whether gcc understands -c and -o together... (cached) yes
checking dependency style of gcc... (cached) gcc3
checking for flex... flex
checking lex output file root... lex.yy
checking lex library... -lfl
checking whether yytext is a pointer... yes
checking for bison... bison -y
checking build system type... x86_64-unknown-linux-gnu
checking host system type... x86_64-unknown-linux-gnu
checking how to print strings... printf
checking for a sed that does not truncate output... /usr/bin/sed
checking for grep that handles long lines and -e... /usr/bin/grep
checking for egrep... /usr/bin/grep -E
checking for fgrep... /usr/bin/grep -F
checking for ld used by gcc... /usr/bin/ld
checking if the linker (/usr/bin/ld) is GNU ld... yes
checking for BSD- or MS-compatible name lister (nm)... /usr/bin/nm -B
checking the name lister (/usr/bin/nm -B) interface... BSD nm
checking whether ln -s works... yes
checking the maximum length of command line arguments... 1572864
checking whether the shell understands some XSI constructs... yes
checking whether the shell understands "+="... yes
checking how to convert x86_64-unknown-linux-gnu file names to x86_64-unknown-linux-gnu format... func_convert_file_noop
checking how to convert x86_64-unknown-linux-gnu file names to toolchain format... func_convert_file_noop
checking for /usr/bin/ld option to reload object files... -r
checking for objdump... objdump
checking how to recognize dependent libraries... pass_all
checking for dlltool... no
checking how to associate runtime and link libraries... printf %s\n
checking for archiver @FILE support... @
checking for strip... strip
checking for ranlib... ranlib
checking command to parse /usr/bin/nm -B output from gcc object... ok
checking for sysroot... no
checking for mt... no
checking if : is a manifest tool... no
checking how to run the C preprocessor... gcc -E
checking for ANSI C header files... yes
checking for sys/types.h... yes
checking for sys/stat.h... yes
checking for stdlib.h... yes
checking for string.h... yes
checking for memory.h... yes
checking for strings.h... yes
checking for inttypes.h... yes
checking for stdint.h... yes
checking for unistd.h... yes
checking for dlfcn.h... yes
checking for objdir... .libs
checking if gcc supports -fno-rtti -fno-exceptions... no
checking for gcc option to produce PIC... -fPIC -DPIC
checking if gcc PIC flag -fPIC -DPIC works... yes
checking if gcc static flag -static works... yes
checking if gcc supports -c -o file.o... yes
checking if gcc supports -c -o file.o... (cached) yes
checking whether the gcc linker (/usr/bin/ld -m elf_i386) supports shared libraries... yes
checking whether -lc should be explicitly linked in... no
checking dynamic linker characteristics... GNU/Linux ld.so
checking how to hardcode library paths into programs... immediate
checking whether stripping libraries is possible... yes
checking if libtool supports shared libraries... yes
checking whether to build shared libraries... yes
checking whether to build static libraries... yes
checking for the pthreads library -lpthreads... no
checking whether pthreads work without any flags... no
checking whether pthreads work with -Kthread... no
checking whether pthreads work with -kthread... no
checking for the pthreads library -llthread... no
checking whether pthreads work with -pthread... yes
checking for joinable pthread attribute... PTHREAD_CREATE_JOINABLE
checking if more special flags are required for pthreads... no
checking whether to check for GCC pthread/shared inconsistencies... yes
checking whether -pthread is sufficient with -shared... yes
checking for isnan in -lm... yes
checking for log2 in -lm... yes
checking for strlcpy... no
checking for strlcat... no
checking for memmem... yes
checking for timegm... yes
checking that generated files are newer than configure... done
configure: creating ./config.status
config.status: creating Makefile
config.status: creating libyara/Makefile
config.status: creating config.h
config.status: executing depfiles commands
config.status: executing libtool commands
rekall_yara/yara/libyara/modules/pe_utils.c: In function 'ord_lookup':
rekall_yara/yara/libyara/modules/pe_utils.c:105:7: warning: implicit declaration of function 'strncasecmp' [-Wimplicit-function-declaration]
   if (strncasecmp(dll, "WS2_32.dll", 10) == 0 ||
       ^~~~~~~~~~~
rekall_yara/yara/libyara/modules/pe_utils.c:110:9: warning: implicit declaration of function 'sprintf' [-Wimplicit-function-declaration]
         sprintf(name, "accept");
         ^~~~~~~
rekall_yara/yara/libyara/modules/pe_utils.c:110:9: warning: incompatible implicit declaration of built-in function 'sprintf'
rekall_yara/yara/libyara/modules/pe_utils.c:110:9: note: include '<stdio.h>' or provide a declaration of 'sprintf'
rekall_yara/yara/libyara/modules/pe_utils.c:468:9: warning: incompatible implicit declaration of built-in function 'sprintf'
         sprintf(name, "SysAllocString");
         ^~~~~~~
rekall_yara/yara/libyara/modules/pe_utils.c:468:9: note: include '<stdio.h>' or provide a declaration of 'sprintf'
rekall_yara/yara/libyara/modules/pe_utils.c:1667:5: warning: incompatible implicit declaration of built-in function 'sprintf'
     sprintf(name, "ord%u", ord);
     ^~~~~~~
rekall_yara/yara/libyara/modules/pe_utils.c:1667:5: note: include '<stdio.h>' or provide a declaration of 'sprintf'
rekall_yara/yara/libyara/modules/pe_utils.c:1669:10: warning: implicit declaration of function 'yr_strdup' [-Wimplicit-function-declaration]
   return yr_strdup(name);
          ^~~~~~~~~
rekall_yara/yara/libyara/modules/pe_utils.c:1669:10: warning: return makes pointer from integer without a cast [-Wint-conversion]
   return yr_strdup(name);
          ^~~~~~~~~~~~~~~
creating /build/python2-rekall/pkg/python2-rekall/usr/share/rekall/virtualenv/1.6.0-1/lib/python2.7/site-packages/rekall_yara-3.4.0.1-py2.7-linux-x86_64.egg
Extracting rekall_yara-3.4.0.1-py2.7-linux-x86_64.egg to /build/python2-rekall/pkg/python2-rekall/usr/share/rekall/virtualenv/1.6.0-1/lib/python2.7/site-packages
Adding rekall-yara 3.4.0.1 to easy-install.pth file

Installed /build/python2-rekall/pkg/python2-rekall/usr/share/rekall/virtualenv/1.6.0-1/lib/python2.7/site-packages/rekall_yara-3.4.0.1-py2.7-linux-x86_64.egg
Searching for rekall-capstone==3.0.4.post2
Reading https://pypi.python.org/simple/rekall-capstone/
Downloading https://pypi.python.org/packages/6a/2e/896cf5a8ad1ef87b82fbd824cdd28b4a4c9c66a6223bc57d694d18ca3f2e/rekall-capstone-3.0.4.post2.zip#md5=d2e8fb986c76e26aaa58eab21d99cc75
Best match: rekall-capstone 3.0.4.post2
Processing rekall-capstone-3.0.4.post2.zip
Writing /tmp/easy_install-30IVQu/rekall-capstone-3.0.4.post2/setup.cfg
Running rekall-capstone-3.0.4.post2/setup.py -q bdist_egg --dist-dir /tmp/easy_install-30IVQu/rekall-capstone-3.0.4.post2/egg-dist-tmp-oc1mfN
warning: no files found matching 'LICENSE.TXT'
warning: no files found matching 'README'
creating /build/python2-rekall/pkg/python2-rekall/usr/share/rekall/virtualenv/1.6.0-1/lib/python2.7/site-packages/rekall_capstone-3.0.4.post2-py2.7-linux-x86_64.egg
Extracting rekall_capstone-3.0.4.post2-py2.7-linux-x86_64.egg to /build/python2-rekall/pkg/python2-rekall/usr/share/rekall/virtualenv/1.6.0-1/lib/python2.7/site-packages
Adding rekall-capstone 3.0.4.post2 to easy-install.pth file

Installed /build/python2-rekall/pkg/python2-rekall/usr/share/rekall/virtualenv/1.6.0-1/lib/python2.7/site-packages/rekall_capstone-3.0.4.post2-py2.7-linux-x86_64.egg
Searching for psutil<5.0,>=4.0
Reading https://pypi.python.org/simple/psutil/
Downloading https://pypi.python.org/packages/6c/49/0f784a247868e167389f6ac76b8699b2f3d6f4e8e85685dfec43e58d1ed1/psutil-4.4.2.tar.gz#md5=189749a7b00813dffd6dac516a1166ef
Best match: psutil 4.4.2
Processing psutil-4.4.2.tar.gz
Writing /tmp/easy_install-XRasb4/psutil-4.4.2/setup.cfg
Running psutil-4.4.2/setup.py -q bdist_egg --dist-dir /tmp/easy_install-XRasb4/psutil-4.4.2/egg-dist-tmp-0m5FxJ
warning: no previously-included files matching '*' found under directory 'docs/_build'
zip_safe flag not set; analyzing archive contents...
psutil.__init__: module references __file__
psutil.tests.__init__: module references __file__
psutil.tests.runner: module references __file__
psutil.tests.test_bsd: module references __file__
psutil.tests.test_linux: module references __file__
psutil.tests.test_memory_leaks: module references __file__
psutil.tests.test_misc: module references __file__
psutil.tests.test_osx: module references __file__
psutil.tests.test_posix: module references __file__
psutil.tests.test_process: module references __file__
psutil.tests.test_sunos: module references __file__
psutil.tests.test_system: module references __file__
psutil.tests.test_windows: module references __file__
creating /build/python2-rekall/pkg/python2-rekall/usr/share/rekall/virtualenv/1.6.0-1/lib/python2.7/site-packages/psutil-4.4.2-py2.7-linux-x86_64.egg
Extracting psutil-4.4.2-py2.7-linux-x86_64.egg to /build/python2-rekall/pkg/python2-rekall/usr/share/rekall/virtualenv/1.6.0-1/lib/python2.7/site-packages
Adding psutil 4.4.2 to easy-install.pth file

Installed /build/python2-rekall/pkg/python2-rekall/usr/share/rekall/virtualenv/1.6.0-1/lib/python2.7/site-packages/psutil-4.4.2-py2.7-linux-x86_64.egg
Searching for pytz==2016.4
Reading https://pypi.python.org/simple/pytz/
Downloading https://pypi.python.org/packages/ae/d1/4dcd5ec1c8aafdbf417d0ae7ac039ff674277856d40f051f6e98d7efeb59/pytz-2016.4-py2.7.egg#md5=a23e0be3e26199ef69371649358be7ad
Best match: pytz 2016.4
Processing pytz-2016.4-py2.7.egg
Moving pytz-2016.4-py2.7.egg to /build/python2-rekall/pkg/python2-rekall/usr/share/rekall/virtualenv/1.6.0-1/lib/python2.7/site-packages
Adding pytz 2016.4 to easy-install.pth file

Installed /build/python2-rekall/pkg/python2-rekall/usr/share/rekall/virtualenv/1.6.0-1/lib/python2.7/site-packages/pytz-2016.4-py2.7.egg
Searching for pyparsing==2.1.5
Reading https://pypi.python.org/simple/pyparsing/
Downloading https://pypi.python.org/packages/9e/37/171c883978003807369e3a5fadd621766a48eb3889032af6ad620a229b37/pyparsing-2.1.5.zip#md5=2a94424d19e96e19aca9f78b198f9070
Best match: pyparsing 2.1.5
Processing pyparsing-2.1.5.zip
Writing /tmp/easy_install-GFpXgJ/pyparsing-2.1.5/setup.cfg
Running pyparsing-2.1.5/setup.py -q bdist_egg --dist-dir /tmp/easy_install-GFpXgJ/pyparsing-2.1.5/egg-dist-tmp-vkvWZe
zip_safe flag not set; analyzing archive contents...
Moving pyparsing-2.1.5-py2.7.egg to /build/python2-rekall/pkg/python2-rekall/usr/share/rekall/virtualenv/1.6.0-1/lib/python2.7/site-packages
Adding pyparsing 2.1.5 to easy-install.pth file

Installed /build/python2-rekall/pkg/python2-rekall/usr/share/rekall/virtualenv/1.6.0-1/lib/python2.7/site-packages/pyparsing-2.1.5-py2.7.egg
Searching for pyelftools==0.24
Reading https://pypi.python.org/simple/pyelftools/
Downloading https://pypi.python.org/packages/ba/78/d4a186a2e38731286c99dc3e3ca8123b6f55cf2e28608e8daf2d84b65494/pyelftools-0.24.tar.gz#md5=c960d5fe0a9308d96ba38b4beec8ac8e
Best match: pyelftools 0.24
Processing pyelftools-0.24.tar.gz
Writing /tmp/easy_install-bw3Y7M/pyelftools-0.24/setup.cfg
Running pyelftools-0.24/setup.py -q bdist_egg --dist-dir /tmp/easy_install-bw3Y7M/pyelftools-0.24/egg-dist-tmp-L80vUE
zip_safe flag not set; analyzing archive contents...
elftools.construct.debug: module MAY be using inspect.stack
creating /build/python2-rekall/pkg/python2-rekall/usr/share/rekall/virtualenv/1.6.0-1/lib/python2.7/site-packages/pyelftools-0.24-py2.7.egg
Extracting pyelftools-0.24-py2.7.egg to /build/python2-rekall/pkg/python2-rekall/usr/share/rekall/virtualenv/1.6.0-1/lib/python2.7/site-packages
Adding pyelftools 0.24 to easy-install.pth file
Installing readelf.py script to /build/python2-rekall/pkg/python2-rekall/usr/share/rekall/virtualenv/1.6.0-1/bin

Installed /build/python2-rekall/pkg/python2-rekall/usr/share/rekall/virtualenv/1.6.0-1/lib/python2.7/site-packages/pyelftools-0.24-py2.7.egg
Searching for pycrypto==2.6.1
Reading https://pypi.python.org/simple/pycrypto/
Downloading https://pypi.python.org/packages/60/db/645aa9af249f059cc3a368b118de33889219e0362141e75d4eaf6f80f163/pycrypto-2.6.1.tar.gz#md5=55a61a054aa66812daf5161a0d5d7eda
Best match: pycrypto 2.6.1
Processing pycrypto-2.6.1.tar.gz
Writing /tmp/easy_install-qkWj6u/pycrypto-2.6.1/setup.cfg
Running pycrypto-2.6.1/setup.py -q bdist_egg --dist-dir /tmp/easy_install-qkWj6u/pycrypto-2.6.1/egg-dist-tmp-Hs2cN7
In file included from /usr/include/python2.7/Python.h:8:0,
                 from src/_fastmath.c:31:
/usr/include/python2.7/pyconfig.h:1193:0: warning: "_POSIX_C_SOURCE" redefined
 #define _POSIX_C_SOURCE 200112L
 
In file included from /usr/include/bits/libc-header-start.h:33:0,
                 from /usr/include/stdio.h:27,
                 from src/_fastmath.c:29:
/usr/include/features.h:289:0: note: this is the location of the previous definition
 # define _POSIX_C_SOURCE 199506L
 
In file included from /usr/include/python2.7/Python.h:8:0,
                 from src/MD2.c:31:
/usr/include/python2.7/pyconfig.h:1193:0: warning: "_POSIX_C_SOURCE" redefined
 #define _POSIX_C_SOURCE 200112L
 
In file included from /usr/include/bits/libc-header-start.h:33:0,
                 from /usr/include/string.h:26,
                 from src/MD2.c:30:
/usr/include/features.h:289:0: note: this is the location of the previous definition
 # define _POSIX_C_SOURCE 199506L
 
In file included from /usr/include/python2.7/Python.h:8:0,
                 from src/MD4.c:31:
/usr/include/python2.7/pyconfig.h:1193:0: warning: "_POSIX_C_SOURCE" redefined
 #define _POSIX_C_SOURCE 200112L
 
In file included from /usr/include/bits/libc-header-start.h:33:0,
                 from /usr/include/string.h:26,
                 from src/MD4.c:30:
/usr/include/features.h:289:0: note: this is the location of the previous definition
 # define _POSIX_C_SOURCE 199506L
 
In file included from /usr/include/python2.7/Python.h:8:0,
                 from src/hash_SHA2_template.c:33,
                 from src/SHA256.c:72:
/usr/include/python2.7/pyconfig.h:1193:0: warning: "_POSIX_C_SOURCE" redefined
 #define _POSIX_C_SOURCE 200112L
 
In file included from /usr/include/bits/libc-header-start.h:33:0,
                 from /usr/include/stdint.h:26,
                 from /usr/lib/gcc/i686-pc-linux-gnu/7.2.0/include/stdint.h:9,
                 from src/hash_SHA2.h:72,
                 from src/SHA256.c:35:
/usr/include/features.h:289:0: note: this is the location of the previous definition
 # define _POSIX_C_SOURCE 199506L
 
In file included from /usr/include/python2.7/Python.h:8:0,
                 from src/hash_SHA2_template.c:33,
                 from src/SHA224.c:73:
/usr/include/python2.7/pyconfig.h:1193:0: warning: "_POSIX_C_SOURCE" redefined
 #define _POSIX_C_SOURCE 200112L
 
In file included from /usr/include/bits/libc-header-start.h:33:0,
                 from /usr/include/stdint.h:26,
                 from /usr/lib/gcc/i686-pc-linux-gnu/7.2.0/include/stdint.h:9,
                 from src/hash_SHA2.h:72,
                 from src/SHA224.c:36:
/usr/include/features.h:289:0: note: this is the location of the previous definition
 # define _POSIX_C_SOURCE 199506L
 
In file included from /usr/include/python2.7/Python.h:8:0,
                 from src/hash_SHA2_template.c:33,
                 from src/SHA384.c:80:
/usr/include/python2.7/pyconfig.h:1193:0: warning: "_POSIX_C_SOURCE" redefined
 #define _POSIX_C_SOURCE 200112L
 
In file included from /usr/include/bits/libc-header-start.h:33:0,
                 from /usr/include/stdint.h:26,
                 from /usr/lib/gcc/i686-pc-linux-gnu/7.2.0/include/stdint.h:9,
                 from src/hash_SHA2.h:72,
                 from src/SHA384.c:36:
/usr/include/features.h:289:0: note: this is the location of the previous definition
 # define _POSIX_C_SOURCE 199506L
 
In file included from /usr/include/python2.7/Python.h:8:0,
                 from src/hash_SHA2_template.c:33,
                 from src/SHA512.c:80:
/usr/include/python2.7/pyconfig.h:1193:0: warning: "_POSIX_C_SOURCE" redefined
 #define _POSIX_C_SOURCE 200112L
 
In file included from /usr/include/bits/libc-header-start.h:33:0,
                 from /usr/include/stdint.h:26,
                 from /usr/lib/gcc/i686-pc-linux-gnu/7.2.0/include/stdint.h:9,
                 from src/hash_SHA2.h:72,
                 from src/SHA512.c:36:
/usr/include/features.h:289:0: note: this is the location of the previous definition
 # define _POSIX_C_SOURCE 199506L
 
In file included from /usr/include/python2.7/Python.h:8:0,
                 from src/RIPEMD160.c:57:
/usr/include/python2.7/pyconfig.h:1193:0: warning: "_POSIX_C_SOURCE" redefined
 #define _POSIX_C_SOURCE 200112L
 
In file included from /usr/include/bits/libc-header-start.h:33:0,
                 from /usr/include/stdint.h:26,
                 from /usr/lib/gcc/i686-pc-linux-gnu/7.2.0/include/stdint.h:9,
                 from src/RIPEMD160.c:48:
/usr/include/features.h:289:0: note: this is the location of the previous definition
 # define _POSIX_C_SOURCE 199506L
 
In file included from /usr/include/python2.7/Python.h:8:0,
                 from src/AES.c:29:
/usr/include/python2.7/pyconfig.h:1193:0: warning: "_POSIX_C_SOURCE" redefined
 #define _POSIX_C_SOURCE 200112L
 
In file included from /usr/include/assert.h:35:0,
                 from src/AES.c:27:
/usr/include/features.h:289:0: note: this is the location of the previous definition
 # define _POSIX_C_SOURCE 199506L
 
In file included from /usr/include/python2.7/Python.h:8:0,
                 from src/ARC2.c:45:
/usr/include/python2.7/pyconfig.h:1193:0: warning: "_POSIX_C_SOURCE" redefined
 #define _POSIX_C_SOURCE 200112L
 
In file included from /usr/include/bits/libc-header-start.h:33:0,
                 from /usr/include/string.h:26,
                 from src/ARC2.c:44:
/usr/include/features.h:289:0: note: this is the location of the previous definition
 # define _POSIX_C_SOURCE 199506L
 
In file included from /usr/include/python2.7/Python.h:8:0,
                 from src/Blowfish.c:39:
/usr/include/python2.7/pyconfig.h:1193:0: warning: "_POSIX_C_SOURCE" redefined
 #define _POSIX_C_SOURCE 200112L
 
In file included from /usr/include/bits/libc-header-start.h:33:0,
                 from /usr/include/stdint.h:26,
                 from /usr/lib/gcc/i686-pc-linux-gnu/7.2.0/include/stdint.h:9,
                 from src/Blowfish.c:31:
/usr/include/features.h:289:0: note: this is the location of the previous definition
 # define _POSIX_C_SOURCE 199506L
 
In file included from /usr/include/python2.7/Python.h:8:0,
                 from src/DES.c:37:
/usr/include/python2.7/pyconfig.h:1193:0: warning: "_POSIX_C_SOURCE" redefined
 #define _POSIX_C_SOURCE 200112L
 
In file included from /usr/include/assert.h:35:0,
                 from src/libtom/tomcrypt.h:3,
                 from src/libtom/tomcrypt_des.c:11,
                 from src/DES.c:32:
/usr/include/features.h:289:0: note: this is the location of the previous definition
 # define _POSIX_C_SOURCE 199506L
 
In file included from /usr/include/python2.7/Python.h:8:0,
                 from src/DES.c:37,
                 from src/DES3.c:26:
/usr/include/python2.7/pyconfig.h:1193:0: warning: "_POSIX_C_SOURCE" redefined
 #define _POSIX_C_SOURCE 200112L
 
In file included from /usr/include/assert.h:35:0,
                 from src/libtom/tomcrypt.h:3,
                 from src/libtom/tomcrypt_des.c:11,
                 from src/DES.c:32,
                 from src/DES3.c:26:
/usr/include/features.h:289:0: note: this is the location of the previous definition
 # define _POSIX_C_SOURCE 199506L
 
In file included from /usr/include/python2.7/Python.h:8:0,
                 from src/_counter.c:28:
/usr/include/python2.7/pyconfig.h:1193:0: warning: "_POSIX_C_SOURCE" redefined
 #define _POSIX_C_SOURCE 200112L
 
In file included from /usr/include/assert.h:35:0,
                 from src/_counter.c:25:
/usr/include/features.h:289:0: note: this is the location of the previous definition
 # define _POSIX_C_SOURCE 199506L
 
zip_safe flag not set; analyzing archive contents...
Moving pycrypto-2.6.1-py2.7-linux-x86_64.egg to /build/python2-rekall/pkg/python2-rekall/usr/share/rekall/virtualenv/1.6.0-1/lib/python2.7/site-packages
Adding pycrypto 2.6.1 to easy-install.pth file

Installed /build/python2-rekall/pkg/python2-rekall/usr/share/rekall/virtualenv/1.6.0-1/lib/python2.7/site-packages/pycrypto-2.6.1-py2.7-linux-x86_64.egg
Searching for intervaltree==2.1.0
Reading https://pypi.python.org/simple/intervaltree/
Downloading https://pypi.python.org/packages/ca/c1/450d109b70fa58ca9d77972b02f69222412f9175ccf99fdeaf167be9583c/intervaltree-2.1.0.tar.gz#md5=33bef3448aaf30b78aa093dc7c315c2c
Best match: intervaltree 2.1.0
Processing intervaltree-2.1.0.tar.gz
Writing /tmp/easy_install-TQVo8S/intervaltree-2.1.0/setup.cfg
Running intervaltree-2.1.0/setup.py -q bdist_egg --dist-dir /tmp/easy_install-TQVo8S/intervaltree-2.1.0/egg-dist-tmp-kSQ2XA
Version: 2.1.0
Reading README.rst
Moving intervaltree-2.1.0-py2.7.egg to /build/python2-rekall/pkg/python2-rekall/usr/share/rekall/virtualenv/1.6.0-1/lib/python2.7/site-packages
Adding intervaltree 2.1.0 to easy-install.pth file

Installed /build/python2-rekall/pkg/python2-rekall/usr/share/rekall/virtualenv/1.6.0-1/lib/python2.7/site-packages/intervaltree-2.1.0-py2.7.egg
Searching for efilter==1!1.3
Reading https://pypi.python.org/simple/efilter/
Downloading https://pypi.python.org/packages/2c/de/d1740a7c17f08d5ccddd4811eb4f089d4f4ea7a26645908c49cdad679805/efilter-1!1.3.tar.gz#md5=4c9a069347e9a7ffc6f4ae04936a54fb
Best match: efilter 1!1.3
Processing efilter-1!1.3.tar.gz
Writing /tmp/easy_install-wCxjWk/efilter-1-1.3/setup.cfg
Running efilter-1-1.3/setup.py -q bdist_egg --dist-dir /tmp/easy_install-wCxjWk/efilter-1-1.3/egg-dist-tmp-XAwVHW
zip_safe flag not set; analyzing archive contents...
sample_projects.star_catalog.star_catalog: module references __file__
creating /build/python2-rekall/pkg/python2-rekall/usr/share/rekall/virtualenv/1.6.0-1/lib/python2.7/site-packages/efilter-1!1.3-py2.7.egg
Extracting efilter-1!1.3-py2.7.egg to /build/python2-rekall/pkg/python2-rekall/usr/share/rekall/virtualenv/1.6.0-1/lib/python2.7/site-packages
Adding efilter 1!1.3 to easy-install.pth file

Installed /build/python2-rekall/pkg/python2-rekall/usr/share/rekall/virtualenv/1.6.0-1/lib/python2.7/site-packages/efilter-1!1.3-py2.7.egg
Searching for arrow==0.7.0
Reading https://pypi.python.org/simple/arrow/
Downloading https://pypi.python.org/packages/57/be/db25f7bd8f0e40cd57d80497c0cc298b50e24b3160f5bdf1a5ac4b2e448a/arrow-0.7.0.tar.gz#md5=1597108362c5fa675dc5e0524ece4451
Best match: arrow 0.7.0
Processing arrow-0.7.0.tar.gz
Writing /tmp/easy_install-ngm2i9/arrow-0.7.0/setup.cfg
Running arrow-0.7.0/setup.py -q bdist_egg --dist-dir /tmp/easy_install-ngm2i9/arrow-0.7.0/egg-dist-tmp-q1JnX8
creating /build/python2-rekall/pkg/python2-rekall/usr/share/rekall/virtualenv/1.6.0-1/lib/python2.7/site-packages/arrow-0.7.0-py2.7.egg
Extracting arrow-0.7.0-py2.7.egg to /build/python2-rekall/pkg/python2-rekall/usr/share/rekall/virtualenv/1.6.0-1/lib/python2.7/site-packages
Adding arrow 0.7.0 to easy-install.pth file

Installed /build/python2-rekall/pkg/python2-rekall/usr/share/rekall/virtualenv/1.6.0-1/lib/python2.7/site-packages/arrow-0.7.0-py2.7.egg
Searching for acora==2.0
Reading https://pypi.python.org/simple/acora/
Downloading https://pypi.python.org/packages/96/2b/e4dfd6be50b239d45f90f10db6f7fad8ffcb72bc52620a0b2038318152a3/acora-2.0.tar.gz#md5=ba43c40dcc00edf945c17b39da4eb79f
Best match: acora 2.0
Processing acora-2.0.tar.gz
Writing /tmp/easy_install-Sdb7ON/acora-2.0/setup.cfg
Running acora-2.0/setup.py -q bdist_egg --dist-dir /tmp/easy_install-Sdb7ON/acora-2.0/egg-dist-tmp-TROwCu
creating /build/python2-rekall/pkg/python2-rekall/usr/share/rekall/virtualenv/1.6.0-1/lib/python2.7/site-packages/acora-2.0-py2.7-linux-x86_64.egg
Extracting acora-2.0-py2.7-linux-x86_64.egg to /build/python2-rekall/pkg/python2-rekall/usr/share/rekall/virtualenv/1.6.0-1/lib/python2.7/site-packages
Adding acora 2.0 to easy-install.pth file

Installed /build/python2-rekall/pkg/python2-rekall/usr/share/rekall/virtualenv/1.6.0-1/lib/python2.7/site-packages/acora-2.0-py2.7-linux-x86_64.egg
Searching for PyYAML==3.11
Reading https://pypi.python.org/simple/PyYAML/
Downloading https://pypi.python.org/packages/75/5e/b84feba55e20f8da46ead76f14a3943c8cb722d40360702b2365b91dec00/PyYAML-3.11.tar.gz#md5=f50e08ef0fe55178479d3a618efe21db
Best match: PyYAML 3.11
Processing PyYAML-3.11.tar.gz
Writing /tmp/easy_install-I_SrtB/PyYAML-3.11/setup.cfg
Running PyYAML-3.11/setup.py -q bdist_egg --dist-dir /tmp/easy_install-I_SrtB/PyYAML-3.11/egg-dist-tmp-4CAkcj
build/temp.linux-x86_64-2.7/check_libyaml.c:2:10: fatal error: yaml.h: No such file or directory
 #include <yaml.h>
          ^~~~~~~~
compilation terminated.

libyaml is not found or a compiler error: forcing --without-libyaml
(if libyaml is installed correctly, you may need to
 specify the option --include-dirs or uncomment and
 modify the parameter include_dirs in setup.cfg)
zip_safe flag not set; analyzing archive contents...
Moving PyYAML-3.11-py2.7-linux-x86_64.egg to /build/python2-rekall/pkg/python2-rekall/usr/share/rekall/virtualenv/1.6.0-1/lib/python2.7/site-packages
Adding PyYAML 3.11 to easy-install.pth file

Installed /build/python2-rekall/pkg/python2-rekall/usr/share/rekall/virtualenv/1.6.0-1/lib/python2.7/site-packages/PyYAML-3.11-py2.7-linux-x86_64.egg
Searching for pyaff4<0.30,>=0.24
Reading https://pypi.python.org/simple/pyaff4/
Downloading https://pypi.python.org/packages/b3/14/19faf92578615051418001bbf843ee9480484383a5d1245533b7c13846cd/pyaff4-0.24.post3.tar.gz#md5=d08105f01ff5a1cef3a720db63d5bf27
Best match: pyaff4 0.24.post3
Processing pyaff4-0.24.post3.tar.gz
Writing /tmp/easy_install-f2jDMl/pyaff4-0.24.post3/setup.cfg
Running pyaff4-0.24.post3/setup.py -q bdist_egg --dist-dir /tmp/easy_install-f2jDMl/pyaff4-0.24.post3/egg-dist-tmp-FCPHDY
warning: no previously-included files matching '*.pyc' found under directory '*'
warning: no previously-included files found matching '.gitignore'
zip_safe flag not set; analyzing archive contents...
pyaff4._version: module references __file__
creating /build/python2-rekall/pkg/python2-rekall/usr/share/rekall/virtualenv/1.6.0-1/lib/python2.7/site-packages/pyaff4-0.24.post3-py2.7.egg
Extracting pyaff4-0.24.post3-py2.7.egg to /build/python2-rekall/pkg/python2-rekall/usr/share/rekall/virtualenv/1.6.0-1/lib/python2.7/site-packages
Adding pyaff4 0.24.post3 to easy-install.pth file

Installed /build/python2-rekall/pkg/python2-rekall/usr/share/rekall/virtualenv/1.6.0-1/lib/python2.7/site-packages/pyaff4-0.24.post3-py2.7.egg
Searching for artifacts==20160114
Reading https://pypi.python.org/simple/artifacts/
Downloading https://pypi.python.org/packages/47/fc/8f1290142777a344a606d20616a6bde8c22f4581814e52ca8b74b7ab8176/artifacts-20160114.tar.gz#md5=9db32dd9429fb0e09aa5998dfd78067c
Best match: artifacts 20160114
Processing artifacts-20160114.tar.gz
Writing /tmp/easy_install-Nn3CQK/artifacts-20160114/setup.cfg
Running artifacts-20160114/setup.py -q bdist_egg --dist-dir /tmp/easy_install-Nn3CQK/artifacts-20160114/egg-dist-tmp-RWvIqd
warning: no previously-included files found matching '.gitignore'
warning: no previously-included files found matching '*.pyc'
warning: no previously-included files matching '*.pyc' found under directory 'artifacts'
warning: no previously-included files matching '*.pyc' found under directory 'tools'
zip_safe flag not set; analyzing archive contents...
Moving artifacts-20160114-py2.7.egg to /build/python2-rekall/pkg/python2-rekall/usr/share/rekall/virtualenv/1.6.0-1/lib/python2.7/site-packages
Adding artifacts 20160114 to easy-install.pth file
Installing stats.py script to /build/python2-rekall/pkg/python2-rekall/usr/share/rekall/virtualenv/1.6.0-1/bin
Installing validator.py script to /build/python2-rekall/pkg/python2-rekall/usr/share/rekall/virtualenv/1.6.0-1/bin

Installed /build/python2-rekall/pkg/python2-rekall/usr/share/rekall/virtualenv/1.6.0-1/lib/python2.7/site-packages/artifacts-20160114-py2.7.egg
Searching for ptyprocess>=0.5
Reading https://pypi.python.org/simple/ptyprocess/
Downloading https://pypi.python.org/packages/51/83/5d07dc35534640b06f9d9f1a1d2bc2513fb9cc7595a1b0e28ae5477056ce/ptyprocess-0.5.2.tar.gz#md5=d3b8febae1b8c53b054bd818d0bb8665
Best match: ptyprocess 0.5.2
Processing ptyprocess-0.5.2.tar.gz
Writing /tmp/easy_install-qpIqDd/ptyprocess-0.5.2/setup.cfg
Running ptyprocess-0.5.2/setup.py -q bdist_egg --dist-dir /tmp/easy_install-qpIqDd/ptyprocess-0.5.2/egg-dist-tmp-MjcD9A
zip_safe flag not set; analyzing archive contents...
Moving ptyprocess-0.5.2-py2.7.egg to /build/python2-rekall/pkg/python2-rekall/usr/share/rekall/virtualenv/1.6.0-1/lib/python2.7/site-packages
Adding ptyprocess 0.5.2 to easy-install.pth file

Installed /build/python2-rekall/pkg/python2-rekall/usr/share/rekall/virtualenv/1.6.0-1/lib/python2.7/site-packages/ptyprocess-0.5.2-py2.7.egg
Searching for scandir
Reading https://pypi.python.org/simple/scandir/
Downloading https://pypi.python.org/packages/bd/f4/3143e0289faf0883228017dbc6387a66d0b468df646645e29e1eb89ea10e/scandir-1.5.tar.gz#md5=a2713043de681bba6b084be42e7a8a44
Best match: scandir 1.5
Processing scandir-1.5.tar.gz
Writing /tmp/easy_install-jcpjxi/scandir-1.5/setup.cfg
Running scandir-1.5/setup.py -q bdist_egg --dist-dir /tmp/easy_install-jcpjxi/scandir-1.5/egg-dist-tmp-E7kRHO
zip_safe flag not set; analyzing archive contents...
Moving scandir-1.5-py2.7-linux-x86_64.egg to /build/python2-rekall/pkg/python2-rekall/usr/share/rekall/virtualenv/1.6.0-1/lib/python2.7/site-packages
Adding scandir 1.5 to easy-install.pth file

Installed /build/python2-rekall/pkg/python2-rekall/usr/share/rekall/virtualenv/1.6.0-1/lib/python2.7/site-packages/scandir-1.5-py2.7-linux-x86_64.egg
Searching for six
Reading https://pypi.python.org/simple/six/
Downloading https://pypi.python.org/packages/16/d8/bc6316cf98419719bd59c91742194c111b6f2e85abac88e496adefaf7afe/six-1.11.0.tar.gz#md5=d12789f9baf7e9fb2524c0c64f1773f8
Best match: six 1.11.0
Processing six-1.11.0.tar.gz
Writing /tmp/easy_install-25gnSc/six-1.11.0/setup.cfg
Running six-1.11.0/setup.py -q bdist_egg --dist-dir /tmp/easy_install-25gnSc/six-1.11.0/egg-dist-tmp-IaUpYO
no previously-included directories found matching 'documentation/_build'
zip_safe flag not set; analyzing archive contents...
six: module references __path__
creating /build/python2-rekall/pkg/python2-rekall/usr/share/rekall/virtualenv/1.6.0-1/lib/python2.7/site-packages/six-1.11.0-py2.7.egg
Extracting six-1.11.0-py2.7.egg to /build/python2-rekall/pkg/python2-rekall/usr/share/rekall/virtualenv/1.6.0-1/lib/python2.7/site-packages
Adding six 1.11.0 to easy-install.pth file

Installed /build/python2-rekall/pkg/python2-rekall/usr/share/rekall/virtualenv/1.6.0-1/lib/python2.7/site-packages/six-1.11.0-py2.7.egg
Searching for wcwidth
Reading https://pypi.python.org/simple/wcwidth/
Downloading https://pypi.python.org/packages/55/11/e4a2bb08bb450fdbd42cc709dd40de4ed2c472cf0ccb9e64af22279c5495/wcwidth-0.1.7.tar.gz#md5=b3b6a0a08f0c8a34d1de8cf44150a4ad
Best match: wcwidth 0.1.7
Processing wcwidth-0.1.7.tar.gz
Writing /tmp/easy_install-MLjp7l/wcwidth-0.1.7/setup.cfg
Running wcwidth-0.1.7/setup.py -q bdist_egg --dist-dir /tmp/easy_install-MLjp7l/wcwidth-0.1.7/egg-dist-tmp-7ji3te
Moving wcwidth-0.1.7-py2.7.egg to /build/python2-rekall/pkg/python2-rekall/usr/share/rekall/virtualenv/1.6.0-1/lib/python2.7/site-packages
Adding wcwidth 0.1.7 to easy-install.pth file

Installed /build/python2-rekall/pkg/python2-rekall/usr/share/rekall/virtualenv/1.6.0-1/lib/python2.7/site-packages/wcwidth-0.1.7-py2.7.egg
Searching for enum34
Reading https://pypi.python.org/simple/enum34/
Downloading https://pypi.python.org/packages/e8/26/a6101edcf724453845c850281b96b89a10dac6bd98edebc82634fccce6a5/enum34-1.1.6.zip#md5=61ad7871532d4ce2d77fac2579237a9e
Best match: enum34 1.1.6
Processing enum34-1.1.6.zip
Writing /tmp/easy_install-TkjTk2/enum34-1.1.6/setup.cfg
Running enum34-1.1.6/setup.py -q bdist_egg --dist-dir /tmp/easy_install-TkjTk2/enum34-1.1.6/egg-dist-tmp-JOsiPz
zip_safe flag not set; analyzing archive contents...
Moving enum34-1.1.6-py2.7.egg to /build/python2-rekall/pkg/python2-rekall/usr/share/rekall/virtualenv/1.6.0-1/lib/python2.7/site-packages
Adding enum34 1.1.6 to easy-install.pth file

Installed /build/python2-rekall/pkg/python2-rekall/usr/share/rekall/virtualenv/1.6.0-1/lib/python2.7/site-packages/enum34-1.1.6-py2.7.egg
Searching for ipython_genutils
Reading https://pypi.python.org/simple/ipython_genutils/
Downloading https://pypi.python.org/packages/e8/69/fbeffffc05236398ebfcfb512b6d2511c622871dca1746361006da310399/ipython_genutils-0.2.0.tar.gz#md5=5a4f9781f78466da0ea1a648f3e1f79f
Best match: ipython-genutils 0.2.0
Processing ipython_genutils-0.2.0.tar.gz
Writing /tmp/easy_install-D7o9Yu/ipython_genutils-0.2.0/setup.cfg
Running ipython_genutils-0.2.0/setup.py -q bdist_egg --dist-dir /tmp/easy_install-D7o9Yu/ipython_genutils-0.2.0/egg-dist-tmp-7W3Ylm
warning: no previously-included files matching '*~' found anywhere in distribution
warning: no previously-included files matching '*.pyc' found anywhere in distribution
warning: no previously-included files matching '*.pyo' found anywhere in distribution
warning: no previously-included files matching '.git' found anywhere in distribution
warning: no previously-included files matching '.ipynb_checkpoints' found anywhere in distribution
zip_safe flag not set; analyzing archive contents...
Moving ipython_genutils-0.2.0-py2.7.egg to /build/python2-rekall/pkg/python2-rekall/usr/share/rekall/virtualenv/1.6.0-1/lib/python2.7/site-packages
Adding ipython-genutils 0.2.0 to easy-install.pth file

Installed /build/python2-rekall/pkg/python2-rekall/usr/share/rekall/virtualenv/1.6.0-1/lib/python2.7/site-packages/ipython_genutils-0.2.0-py2.7.egg
Searching for rdflib==4.2.1
Reading https://pypi.python.org/simple/rdflib/
Downloading https://pypi.python.org/packages/9d/fa/4198e8d8b444a4ace5c8fd86d128c2faa210a6e281973c8e5e16d978eaf4/rdflib-4.2.1.tar.gz#md5=528adaa10536d14a608507d7831711f5
Best match: rdflib 4.2.1
Processing rdflib-4.2.1.tar.gz
Writing /tmp/easy_install-ptdR5i/rdflib-4.2.1/setup.cfg
Running rdflib-4.2.1/setup.py -q bdist_egg --dist-dir /tmp/easy_install-ptdR5i/rdflib-4.2.1/egg-dist-tmp-eDZObD
no previously-included directories found matching 'docs/_build'
warning: no previously-included files matching '*.pyc' found anywhere in distribution
warning: no previously-included files matching '*$py.class' found anywhere in distribution
zip_safe flag not set; analyzing archive contents...
rdflib.__init__: module references __file__
creating /build/python2-rekall/pkg/python2-rekall/usr/share/rekall/virtualenv/1.6.0-1/lib/python2.7/site-packages/rdflib-4.2.1-py2.7.egg
Extracting rdflib-4.2.1-py2.7.egg to /build/python2-rekall/pkg/python2-rekall/usr/share/rekall/virtualenv/1.6.0-1/lib/python2.7/site-packages
Adding rdflib 4.2.1 to easy-install.pth file
Installing rdf2dot script to /build/python2-rekall/pkg/python2-rekall/usr/share/rekall/virtualenv/1.6.0-1/bin
Installing csv2rdf script to /build/python2-rekall/pkg/python2-rekall/usr/share/rekall/virtualenv/1.6.0-1/bin
Installing rdfpipe script to /build/python2-rekall/pkg/python2-rekall/usr/share/rekall/virtualenv/1.6.0-1/bin
Installing rdfs2dot script to /build/python2-rekall/pkg/python2-rekall/usr/share/rekall/virtualenv/1.6.0-1/bin
Installing rdfgraphisomorphism script to /build/python2-rekall/pkg/python2-rekall/usr/share/rekall/virtualenv/1.6.0-1/bin

Installed /build/python2-rekall/pkg/python2-rekall/usr/share/rekall/virtualenv/1.6.0-1/lib/python2.7/site-packages/rdflib-4.2.1-py2.7.egg
Searching for aff4-snappy==0.5
Reading https://pypi.python.org/simple/aff4-snappy/
Downloading https://pypi.python.org/packages/47/34/0ce59a586573b6543d2c88df0b71b3e65dd4dbc8d437b02702163de5aa73/aff4-snappy-0.5.tar.gz#md5=699c1a120081a0d96d3d42e678e8add0
Best match: aff4-snappy 0.5
Processing aff4-snappy-0.5.tar.gz
Writing /tmp/easy_install-kYr__i/aff4-snappy-0.5/setup.cfg
Running aff4-snappy-0.5/setup.py -q bdist_egg --dist-dir /tmp/easy_install-kYr__i/aff4-snappy-0.5/egg-dist-tmp-RiJPSt
WARNING: '.' not a valid package name; please use only .-separated package names in setup.py
zip_safe flag not set; analyzing archive contents...
Moving aff4_snappy-0.5-py2.7-linux-x86_64.egg to /build/python2-rekall/pkg/python2-rekall/usr/share/rekall/virtualenv/1.6.0-1/lib/python2.7/site-packages
Adding aff4-snappy 0.5 to easy-install.pth file

Installed /build/python2-rekall/pkg/python2-rekall/usr/share/rekall/virtualenv/1.6.0-1/lib/python2.7/site-packages/aff4_snappy-0.5-py2.7-linux-x86_64.egg
Searching for html5lib
Reading https://pypi.python.org/simple/html5lib/
Downloading https://pypi.python.org/packages/97/16/982214624095c1420c75f3bd295d9e658794aafb95fc075823de107e0ae4/html5lib-1.0b10.tar.gz#md5=5ada1243b7a863624b2f35245b2186e9
Best match: html5lib 1.0b10
Processing html5lib-1.0b10.tar.gz
Writing /tmp/easy_install-IBjZCT/html5lib-1.0b10/setup.cfg
Running html5lib-1.0b10/setup.py -q bdist_egg --dist-dir /tmp/easy_install-IBjZCT/html5lib-1.0b10/egg-dist-tmp-4W8Xt2
zip_safe flag not set; analyzing archive contents...
Moving html5lib-1.0b10-py2.7.egg to /build/python2-rekall/pkg/python2-rekall/usr/share/rekall/virtualenv/1.6.0-1/lib/python2.7/site-packages
Adding html5lib 1.0b10 to easy-install.pth file

Installed /build/python2-rekall/pkg/python2-rekall/usr/share/rekall/virtualenv/1.6.0-1/lib/python2.7/site-packages/html5lib-1.0b10-py2.7.egg
Searching for SPARQLWrapper
Reading https://pypi.python.org/simple/SPARQLWrapper/
Downloading https://pypi.python.org/packages/02/7a/93e5bdccb32090e993b94583425e8d35d157ba996f2c852cc382866ae5af/SPARQLWrapper-1.8.0-py2.7.egg#md5=c660ba03c7930192e31c78dc8a780955
Best match: SPARQLWrapper 1.8.0
Processing SPARQLWrapper-1.8.0-py2.7.egg
Moving SPARQLWrapper-1.8.0-py2.7.egg to /build/python2-rekall/pkg/python2-rekall/usr/share/rekall/virtualenv/1.6.0-1/lib/python2.7/site-packages
Adding SPARQLWrapper 1.8.0 to easy-install.pth file

Installed /build/python2-rekall/pkg/python2-rekall/usr/share/rekall/virtualenv/1.6.0-1/lib/python2.7/site-packages/SPARQLWrapper-1.8.0-py2.7.egg
Searching for isodate
Reading https://pypi.python.org/simple/isodate/
Downloading https://pypi.python.org/packages/f4/5b/fe03d46ced80639b7be9285492dc8ce069b841c0cebe5baacdd9b090b164/isodate-0.5.4.tar.gz#md5=9da3ea2af54a6261d854e73d2266030e
Best match: isodate 0.5.4
Processing isodate-0.5.4.tar.gz
Writing /tmp/easy_install-pjUfw8/isodate-0.5.4/setup.cfg
Running isodate-0.5.4/setup.py -q bdist_egg --dist-dir /tmp/easy_install-pjUfw8/isodate-0.5.4/egg-dist-tmp-nJTcWL
zip_safe flag not set; analyzing archive contents...
Moving isodate-0.5.4-py2.7.egg to /build/python2-rekall/pkg/python2-rekall/usr/share/rekall/virtualenv/1.6.0-1/lib/python2.7/site-packages
Adding isodate 0.5.4 to easy-install.pth file

Installed /build/python2-rekall/pkg/python2-rekall/usr/share/rekall/virtualenv/1.6.0-1/lib/python2.7/site-packages/isodate-0.5.4-py2.7.egg
Searching for webencodings
Reading https://pypi.python.org/simple/webencodings/
Downloading https://pypi.python.org/packages/0b/02/ae6ceac1baeda530866a85075641cec12989bd8d31af6d5ab4a3e8c92f47/webencodings-0.5.1.tar.gz#md5=32f6e261d52e57bf7e1c4d41546d15b8
Best match: webencodings 0.5.1
Processing webencodings-0.5.1.tar.gz
Writing /tmp/easy_install-TidSj4/webencodings-0.5.1/setup.cfg
Running webencodings-0.5.1/setup.py -q bdist_egg --dist-dir /tmp/easy_install-TidSj4/webencodings-0.5.1/egg-dist-tmp-HunXLB
zip_safe flag not set; analyzing archive contents...
/build/python2-rekall/pkg/python2-rekall/usr/share/rekall/virtualenv/1.6.0-1/lib/python2.7/site-packages/setuptools/command/bdist_egg.py:403: UnicodeWarning: Unicode equal comparison failed to convert both arguments to Unicode - interpreting them as being unequal
  symbols = dict.fromkeys(iter_symbols(code))
Moving webencodings-0.5.1-py2.7.egg to /build/python2-rekall/pkg/python2-rekall/usr/share/rekall/virtualenv/1.6.0-1/lib/python2.7/site-packages
Adding webencodings 0.5.1 to easy-install.pth file

Installed /build/python2-rekall/pkg/python2-rekall/usr/share/rekall/virtualenv/1.6.0-1/lib/python2.7/site-packages/webencodings-0.5.1-py2.7.egg
Searching for setuptools==36.5.0
Best match: setuptools 36.5.0
Adding setuptools 36.5.0 to easy-install.pth file
Installing easy_install script to /build/python2-rekall/pkg/python2-rekall/usr/share/rekall/virtualenv/1.6.0-1/bin
Installing easy_install-3.6 script to /build/python2-rekall/pkg/python2-rekall/usr/share/rekall/virtualenv/1.6.0-1/bin

Using /build/python2-rekall/pkg/python2-rekall/usr/share/rekall/virtualenv/1.6.0-1/lib/python2.7/site-packages
Finished processing dependencies for rekall==1.6.0
==> Tidying install...
  -> Removing libtool files...
  -> Purging unwanted files...
  -> Removing static library files...
  -> Stripping unneeded symbols from binaries and libraries...
  -> Compressing man and info pages...
==> Checking for packaging issue...
==> Creating package "python2-rekall"...
  -> Generating .PKGINFO file...
  -> Generating .BUILDINFO file...
error: invalid option '--noprogressbar'
  -> Generating .MTREE file...
  -> Compressing package...
==> Leaving fakeroot environment.
==> Finished making: python2-rekall 1.6.0-1 (Thu Sep 21 14:32:38 EDT 2017)
==> Cleaning up...
==> Removing installed dependencies...
checking dependencies...

Packages (7) python2-2.7.14-1  python2-appdirs-1.4.3-1  python2-packaging-16.8-2  python2-pyparsing-2.2.0-1  python2-setuptools-1:36.5.0-1  python2-six-1.11.0-1  python2-virtualenv-15.1.0-1

Total Removed Size:  76.80 MiB

:: Do you want to remove these packages? [Y/n] 
:: Processing package changes...
removing python2-virtualenv...
removing python2-setuptools...
removing python2-packaging...
removing python2-six...
removing python2-pyparsing...
removing python2-appdirs...
removing python2...