==> Synchronizing chroot copy [/chroot/i686/root] -> [build]...done
==> Making package: perl-net-pcap 0.18-4 (Sat Jun 27 19:01:14 2020)
==> Retrieving sources...
  -> Found Net-Pcap-0.18.tar.gz
  -> Found listdatalinks.patch
==> Validating source files with sha512sums...
    Net-Pcap-0.18.tar.gz ... Passed
    listdatalinks.patch ... Passed
Host and machine ids are equal (03ca1e0d79db47a597e66a5149387887): refusing to link journals
==> Making package: perl-net-pcap 0.18-4 (Sat 27 Jun 2020 07:01:18 PM EDT)
==> Checking runtime dependencies...
==> Checking buildtime dependencies...
==> Retrieving sources...
  -> Found Net-Pcap-0.18.tar.gz
  -> Found listdatalinks.patch
==> WARNING: Skipping all source file integrity checks.
==> Extracting sources...
  -> Extracting Net-Pcap-0.18.tar.gz with bsdtar
==> Starting prepare()...
patching file Pcap.pm
Hunk #1 succeeded at 714 (offset 10 lines).
==> Starting build()...
looking for -lpcap... yes
checking for pcap_lib_version() in -lpcap... yes
detecting available functions... ok
Checking if your kit is complete...
Looks good
Generating a Unix-style Makefile
Writing Makefile for Net::Pcap
Writing MYMETA.yml and MYMETA.json
cp Pcap.pm blib/lib/Net/Pcap.pm
Running Mkbootstrap for Pcap ()
chmod 644 "Pcap.bs"
"/usr/bin/perl" -MExtUtils::Command::MM -e 'cp_nonempty' -- Pcap.bs blib/arch/auto/Net/Pcap/Pcap.bs 644
"/usr/bin/perl" "/usr/share/perl5/core_perl/ExtUtils/xsubpp"  -typemap '/usr/share/perl5/core_perl/ExtUtils/typemap' -typemap '/build/perl-net-pcap/src/Net-Pcap-0.18/typemap'  Pcap.xs > Pcap.xsc
mv Pcap.xsc Pcap.c
cc -c   -D_REENTRANT -D_GNU_SOURCE -fwrapv -fno-strict-aliasing -pipe -fstack-protector-strong -I/usr/local/include -D_LARGEFILE_SOURCE -D_FILE_OFFSET_BITS=64 -D_FORTIFY_SOURCE=2 -Wall -Wwrite-strings -march=i686 -mtune=generic -O2 -pipe -fno-plt   -DVERSION=\"0.18\" -DXS_VERSION=\"0.18\" -fPIC "-I/usr/lib/perl5/5.32/core_perl/CORE"  -DHAVE_BLANK -DHAVE_PCAP_LIB_VERSION -DHAVE_PCAP_BREAKLOOP -DHAVE_PCAP_COMPILE_NOPCAP -DHAVE_PCAP_DATALINK_NAME_TO_VAL -DHAVE_PCAP_DATALINK_VAL_TO_DESCRIPTION -DHAVE_PCAP_DATALINK_VAL_TO_NAME -DHAVE_PCAP_DUMP_FILE -DHAVE_PCAP_DUMP_FLUSH -DHAVE_PCAP_FINDALLDEVS -DHAVE_PCAP_GETNONBLOCK -DHAVE_PCAP_GET_SELECTABLE_FD -DHAVE_PCAP_LIB_VERSION -DHAVE_PCAP_LIST_DATALINKS -DHAVE_PCAP_NEXT_EX -DHAVE_PCAP_OFFLINE_FILTER -DHAVE_PCAP_OPEN_DEAD -DHAVE_PCAP_SENDPACKET -DHAVE_PCAP_SETNONBLOCK -DHAVE_PCAP_SET_DATALINK Pcap.c
In file included from Pcap.xs:43:
stubs.inc:322:2: warning: #warning "the function pcap_createsrcstr() is not available" []8;;https://gcc.gnu.org/onlinedocs/gcc/Warning-Options.html#index-Wcpp-Wcpp]8;;]
  322 | #warning "the function pcap_createsrcstr() is not available"
      |  ^~~~~~~
stubs.inc:337:2: warning: #warning "the function pcap_parsesrcstr() is not available" []8;;https://gcc.gnu.org/onlinedocs/gcc/Warning-Options.html#index-Wcpp-Wcpp]8;;]
  337 | #warning "the function pcap_parsesrcstr() is not available"
      |  ^~~~~~~
stubs.inc:352:2: warning: #warning "the function pcap_open() is not available" []8;;https://gcc.gnu.org/onlinedocs/gcc/Warning-Options.html#index-Wcpp-Wcpp]8;;]
  352 | #warning "the function pcap_open() is not available"
      |  ^~~~~~~
stubs.inc:357:8: error: redefinition of ‘struct pcap_rmtauth’
  357 | struct pcap_rmtauth {
      |        ^~~~~~~~~~~~
In file included from /usr/include/pcap.h:43,
                 from Pcap.xs:32:
/usr/include/pcap/pcap.h:812:8: note: originally defined here
  812 | struct pcap_rmtauth
      |        ^~~~~~~~~~~~
In file included from Pcap.xs:43:
stubs.inc:363:10: error: conflicting types for ‘pcap_open’
  363 | pcap_t * pcap_open(const char *source, int snaplen, int flags, int read_timeout, struct pcap_rmtauth *auth, char *err);
      |          ^~~~~~~~~
In file included from /usr/include/pcap.h:43,
                 from Pcap.xs:32:
/usr/include/pcap/pcap.h:859:18: note: previous declaration of ‘pcap_open’ was here
  859 | PCAP_API pcap_t *pcap_open(const char *source, int snaplen, int flags,
      |                  ^~~~~~~~~
In file included from Pcap.xs:43:
stubs.inc:364:10: error: conflicting types for ‘pcap_open’
  364 | pcap_t * pcap_open(const char *source, int snaplen, int flags, int read_timeout, struct pcap_rmtauth *auth, char *err) {
      |          ^~~~~~~~~
In file included from /usr/include/pcap.h:43,
                 from Pcap.xs:32:
/usr/include/pcap/pcap.h:859:18: note: previous declaration of ‘pcap_open’ was here
  859 | PCAP_API pcap_t *pcap_open(const char *source, int snaplen, int flags,
      |                  ^~~~~~~~~
In file included from Pcap.xs:43:
stubs.inc:373:2: warning: #warning "the function pcap_setbuff() is not available" []8;;https://gcc.gnu.org/onlinedocs/gcc/Warning-Options.html#index-Wcpp-Wcpp]8;;]
  373 | #warning "the function pcap_setbuff() is not available"
      |  ^~~~~~~
stubs.inc:388:2: warning: #warning "the function pcap_setuserbuffer() is not available" []8;;https://gcc.gnu.org/onlinedocs/gcc/Warning-Options.html#index-Wcpp-Wcpp]8;;]
  388 | #warning "the function pcap_setuserbuffer() is not available"
      |  ^~~~~~~
stubs.inc:403:2: warning: #warning "the function pcap_setmode() is not available" []8;;https://gcc.gnu.org/onlinedocs/gcc/Warning-Options.html#index-Wcpp-Wcpp]8;;]
  403 | #warning "the function pcap_setmode() is not available"
      |  ^~~~~~~
stubs.inc:418:2: warning: #warning "the function pcap_setmintocopy() is not available" []8;;https://gcc.gnu.org/onlinedocs/gcc/Warning-Options.html#index-Wcpp-Wcpp]8;;]
  418 | #warning "the function pcap_setmintocopy() is not available"
      |  ^~~~~~~
stubs.inc:433:2: warning: #warning "the function pcap_sendqueue_alloc() is not available" []8;;https://gcc.gnu.org/onlinedocs/gcc/Warning-Options.html#index-Wcpp-Wcpp]8;;]
  433 | #warning "the function pcap_sendqueue_alloc() is not available"
      |  ^~~~~~~
stubs.inc:455:2: warning: #warning "the function pcap_sendqueue_destroy() is not available" []8;;https://gcc.gnu.org/onlinedocs/gcc/Warning-Options.html#index-Wcpp-Wcpp]8;;]
  455 | #warning "the function pcap_sendqueue_destroy() is not available"
      |  ^~~~~~~
stubs.inc:469:2: warning: #warning "the function pcap_sendqueue_queue() is not available" []8;;https://gcc.gnu.org/onlinedocs/gcc/Warning-Options.html#index-Wcpp-Wcpp]8;;]
  469 | #warning "the function pcap_sendqueue_queue() is not available"
      |  ^~~~~~~
stubs.inc:484:2: warning: #warning "the function pcap_sendqueue_transmit() is not available" []8;;https://gcc.gnu.org/onlinedocs/gcc/Warning-Options.html#index-Wcpp-Wcpp]8;;]
  484 | #warning "the function pcap_sendqueue_transmit() is not available"
      |  ^~~~~~~
stubs.inc:499:2: warning: #warning "the function pcap_event() is not available" []8;;https://gcc.gnu.org/onlinedocs/gcc/Warning-Options.html#index-Wcpp-Wcpp]8;;]
  499 | #warning "the function pcap_event() is not available"
      |  ^~~~~~~
stubs.inc:514:2: warning: #warning "the function pcap_setsampling() is not available" []8;;https://gcc.gnu.org/onlinedocs/gcc/Warning-Options.html#index-Wcpp-Wcpp]8;;]
  514 | #warning "the function pcap_setsampling() is not available"
      |  ^~~~~~~
stubs.inc:519:8: error: redefinition of ‘struct pcap_samp’
  519 | struct pcap_samp {
      |        ^~~~~~~~~
In file included from /usr/include/pcap.h:43,
                 from Pcap.xs:32:
/usr/include/pcap/pcap.h:938:8: note: originally defined here
  938 | struct pcap_samp
      |        ^~~~~~~~~
In file included from Pcap.xs:43:
stubs.inc:524:19: error: conflicting types for ‘pcap_setsampling’
  524 | struct pcap_samp *pcap_setsampling(pcap_t *p);
      |                   ^~~~~~~~~~~~~~~~
In file included from /usr/include/pcap.h:43,
                 from Pcap.xs:32:
/usr/include/pcap/pcap.h:955:28: note: previous declaration of ‘pcap_setsampling’ was here
  955 | PCAP_API struct pcap_samp *pcap_setsampling(pcap_t *p);
      |                            ^~~~~~~~~~~~~~~~
In file included from Pcap.xs:43:
stubs.inc:525:19: error: conflicting types for ‘pcap_setsampling’
  525 | struct pcap_samp *pcap_setsampling(pcap_t *p) {
      |                   ^~~~~~~~~~~~~~~~
In file included from /usr/include/pcap.h:43,
                 from Pcap.xs:32:
/usr/include/pcap/pcap.h:955:28: note: previous declaration of ‘pcap_setsampling’ was here
  955 | PCAP_API struct pcap_samp *pcap_setsampling(pcap_t *p);
      |                            ^~~~~~~~~~~~~~~~
Pcap.xs: In function ‘XS_Net__Pcap_lookupdev’:
Pcap.xs:108:4: warning: pcap_lookupdev’ is deprecated: use 'pcap_findalldevs' and use the first device []8;;https://gcc.gnu.org/onlinedocs/gcc/Warning-Options.html#index-Wdeprecated-declarations-Wdeprecated-declarations]8;;]
  108 |    RETVAL = pcap_lookupdev(errbuf);
      |    ^~~~~~
In file included from /usr/include/pcap.h:43,
                 from Pcap.xs:32:
/usr/include/pcap/pcap.h:328:16: note: declared here
  328 | PCAP_API char *pcap_lookupdev(char *)
      |                ^~~~~~~~~~~~~~
Pcap.xs: In function ‘XS_Net__Pcap_findalldevs_xs’:
Pcap.xs:222:21: warning: pcap_lookupdev’ is deprecated: use 'pcap_findalldevs' and use the first device []8;;https://gcc.gnu.org/onlinedocs/gcc/Warning-Options.html#index-Wdeprecated-declarations-Wdeprecated-declarations]8;;]
  222 |                     char *dev = pcap_lookupdev(errbuf);
      |                     ^~~~
In file included from /usr/include/pcap.h:43,
                 from Pcap.xs:32:
/usr/include/pcap/pcap.h:328:16: note: declared here
  328 | PCAP_API char *pcap_lookupdev(char *)
      |                ^~~~~~~~~~~~~~
Pcap.c: In function ‘XS_Net__Pcap_strerror’:
Pcap.c:1703:9: warning: assignment discards ‘const’ qualifier from pointer target type []8;;https://gcc.gnu.org/onlinedocs/gcc/Warning-Options.html#index-Wdiscarded-qualifiers-Wdiscarded-qualifiers]8;;]
 1703 |  RETVAL = pcap_strerror(error);
      |         ^
make: *** [Makefile:348: Pcap.o] Error 1
==> ERROR: A failure occurred in build().
    Aborting...
==> ERROR: Build failed, check /chroot/i686/build/build