==> Synchronizing chroot copy [/chroot/armv7/root] -> [build]...done
==> Making package: lte-cell-scanner 0.1.1-2 (Mon Mar  4 22:51:36 2019)
==> Retrieving sources...
  -> Found v0.1.1.tar.gz
  -> Found findhackrf.patch
==> Validating source files with sha512sums...
    v0.1.1.tar.gz ... Passed
    findhackrf.patch ... Passed
Host and machine ids are equal (508bc9faf65540dfb4fb1551fd5fdc0a): refusing to link journals
==> Making package: lte-cell-scanner 0.1.1-2 (Mon 04 Mar 2019 10:51:42 PM EST)
==> Checking runtime dependencies...
==> Installing missing dependencies...
resolving dependencies...
looking for conflicting packages...

Packages (8) blas-3.8.0-2  boost-libs-1.69.0-1  fftw-3.3.8-1  lapack-3.8.0-2  boost-1.69.0-1  hackrf-2018.01.1-1  itpp-4.3.1-3  rtl-sdr-20180429-1

Total Download Size:    15.53 MiB
Total Installed Size:  181.28 MiB

:: Proceed with installation? [Y/n] 
:: Retrieving packages...
downloading fftw-3.3.8-1-armv7h.pkg.tar.xz...
downloading boost-libs-1.69.0-1-armv7h.pkg.tar.xz...
downloading boost-1.69.0-1-armv7h.pkg.tar.xz...
downloading rtl-sdr-20180429-1-armv7h.pkg.tar.xz...
downloading hackrf-2018.01.1-1-armv7h.pkg.tar.xz...
downloading itpp-4.3.1-3-armv7h.pkg.tar.xz...
checking keyring...
checking package integrity...
loading package files...
checking for file conflicts...
checking available disk space...
:: Processing package changes...
installing blas...
installing lapack...
installing fftw...
installing itpp...
installing boost-libs...
Optional dependencies for boost-libs
    openmpi: for mpi support
installing boost...
Optional dependencies for boost
    python: for python bindings
    python2: for python2 bindings
installing rtl-sdr...
>>> You can not use a DVB stick for both DVB and SDR.  There is a driver conflict.  /etc/modprobe.d/rtlsdr.conf blacklists the DVB drivers.
installing hackrf...
:: Running post-transaction hooks...
(1/3) Reloading device manager configuration...
  Skipped: Device manager is not running.
(2/3) Arming ConditionNeedsUpdate...
(3/3) Updating the info directory file...
==> Checking buildtime dependencies...
==> Installing missing dependencies...
resolving dependencies...
looking for conflicting packages...

Packages (6) jsoncpp-1.8.4-2  libnsl-1.2.0-1  libuv-1.26.0-1  rhash-1.3.8-1  shared-mime-info-1.12-1  cmake-3.13.4-1

Total Download Size:    5.47 MiB
Total Installed Size:  34.67 MiB

:: Proceed with installation? [Y/n] 
:: Retrieving packages...
downloading jsoncpp-1.8.4-2-armv7h.pkg.tar.xz...
downloading libuv-1.26.0-1-armv7h.pkg.tar.xz...
downloading rhash-1.3.8-1-armv7h.pkg.tar.xz...
downloading cmake-3.13.4-1-armv7h.pkg.tar.xz...
checking keyring...
checking package integrity...
loading package files...
checking for file conflicts...
checking available disk space...
:: Processing package changes...
installing shared-mime-info...
installing jsoncpp...
Optional dependencies for jsoncpp
    jsoncpp-doc: documentation
installing libnsl...
installing libuv...
installing rhash...
installing cmake...
Optional dependencies for cmake
    qt5-base: cmake-gui
    libxkbcommon-x11: cmake-gui
:: Running post-transaction hooks...
(1/2) Arming ConditionNeedsUpdate...
(2/2) Updating the MIME type database...
==> Retrieving sources...
  -> Found v0.1.1.tar.gz
  -> Found findhackrf.patch
==> WARNING: Skipping all source file integrity checks.
==> Extracting sources...
  -> Extracting v0.1.1.tar.gz with bsdtar
==> Starting prepare()...
patching file FindHACKRF.cmake
==> Starting build()...
-- The C compiler identification is GNU 8.2.1
-- The CXX compiler identification is GNU 8.2.1
-- Check for working C compiler: /usr/bin/cc
-- Check for working C compiler: /usr/bin/cc -- works
-- Detecting C compiler ABI info
-- Detecting C compiler ABI info - done
-- Detecting C compile features
-- Detecting C compile features - done
-- Check for working CXX compiler: /usr/bin/c++
-- Check for working CXX compiler: /usr/bin/c++ -- works
-- Detecting CXX compiler ABI info
-- Detecting CXX compiler ABI info - done
-- Detecting CXX compile features
-- Detecting CXX compile features - done
-- Try to find and use OPENCL
-- OPENCL not found.
-- Found OpenMP_C: -fopenmp (found version "4.5") 
-- Found OpenMP_CXX: -fopenmp (found version "4.5") 
-- Found OpenMP: TRUE (found version "4.5")  
-- Looking for pthread.h
-- Looking for pthread.h - found
-- Looking for pthread_create
-- Looking for pthread_create - found
-- Found Threads: TRUE  
-- Boost version: 1.69.0
-- Found the following Boost libraries:
--   thread
--   system
--   chrono
--   date_time
--   atomic
-- Found ITPP: /usr/lib/libitpp.so
-- Looking for sgemm_
-- Looking for sgemm_ - not found
-- Looking for sgemm_
-- Looking for sgemm_ - found
-- Found BLAS: /usr/lib/libblas.so  
-- Looking for cheev_
-- Looking for cheev_ - found
-- A library with LAPACK API found.
-- Found FFTW: /usr/lib/libfftw3.so
-- Found RTLSDR: /usr/lib/librtlsdr.so
-- Found HACKRF: /usr/lib/libhackrf.so
-- Found HACKRF: /usr/lib/libhackrf.so
-- Found Curses: /usr/lib/libcurses.so  
-- Configuring done
-- Generating done
-- Build files have been written to: /build/lte-cell-scanner/src/LTE-Cell-Scanner-0.1.1/build
Scanning dependencies of target LTE_MISC
[  5%] Building CXX object src/CMakeFiles/LTE_MISC.dir/capbuf.cpp.o
In file included from /build/lte-cell-scanner/src/LTE-Cell-Scanner-0.1.1/src/capbuf.cpp:29:
/build/lte-cell-scanner/src/LTE-Cell-Scanner-0.1.1/include/dsp.h: In function ‘itpp::cvec fshift(const cvec&, double, double)’:
/build/lte-cell-scanner/src/LTE-Cell-Scanner-0.1.1/include/dsp.h:47:25: error: lvalue required as left operand of assignment
     coeff.real()=cos(k*t);
                         ^
/build/lte-cell-scanner/src/LTE-Cell-Scanner-0.1.1/include/dsp.h:48:25: error: lvalue required as left operand of assignment
     coeff.imag()=sin(k*t);
                         ^
/build/lte-cell-scanner/src/LTE-Cell-Scanner-0.1.1/include/dsp.h: In function ‘void fshift_inplace(itpp::cvec&, double, double)’:
/build/lte-cell-scanner/src/LTE-Cell-Scanner-0.1.1/include/dsp.h:64:25: error: lvalue required as left operand of assignment
     coeff.real()=cos(k*t);
                         ^
/build/lte-cell-scanner/src/LTE-Cell-Scanner-0.1.1/include/dsp.h:65:25: error: lvalue required as left operand of assignment
     coeff.imag()=sin(k*t);
                         ^
/build/lte-cell-scanner/src/LTE-Cell-Scanner-0.1.1/src/capbuf.cpp: In function ‘int write_header_to_bin(FILE*, const double&, const double&, const double&, const double&)’:
/build/lte-cell-scanner/src/LTE-Cell-Scanner-0.1.1/src/capbuf.cpp:157:20: warning: narrowing conversion of ‘(double)fc_requested’ from ‘double’ to ‘uint64’ {aka ‘long unsigned int’} inside { } [-Wnarrowing]
   uint64 tmp[8] = {fc_requested, fc_programmed, fs_requested, fs_programmed, 0,0,0,0};
                    ^~~~~~~~~~~~
/build/lte-cell-scanner/src/LTE-Cell-Scanner-0.1.1/src/capbuf.cpp:157:34: warning: narrowing conversion of ‘(double)fc_programmed’ from ‘double’ to ‘uint64’ {aka ‘long unsigned int’} inside { } [-Wnarrowing]
   uint64 tmp[8] = {fc_requested, fc_programmed, fs_requested, fs_programmed, 0,0,0,0};
                                  ^~~~~~~~~~~~~
/build/lte-cell-scanner/src/LTE-Cell-Scanner-0.1.1/src/capbuf.cpp:157:49: warning: narrowing conversion of ‘(double)fs_requested’ from ‘double’ to ‘uint64’ {aka ‘long unsigned int’} inside { } [-Wnarrowing]
   uint64 tmp[8] = {fc_requested, fc_programmed, fs_requested, fs_programmed, 0,0,0,0};
                                                 ^~~~~~~~~~~~
/build/lte-cell-scanner/src/LTE-Cell-Scanner-0.1.1/src/capbuf.cpp:157:63: warning: narrowing conversion of ‘(double)fs_programmed’ from ‘double’ to ‘uint64’ {aka ‘long unsigned int’} inside { } [-Wnarrowing]
   uint64 tmp[8] = {fc_requested, fc_programmed, fs_requested, fs_programmed, 0,0,0,0};
                                                               ^~~~~~~~~~~~~
make[2]: *** [src/CMakeFiles/LTE_MISC.dir/build.make:63: src/CMakeFiles/LTE_MISC.dir/capbuf.cpp.o] Error 1
make[1]: *** [CMakeFiles/Makefile2:201: src/CMakeFiles/LTE_MISC.dir/all] Error 2
make: *** [Makefile:141: all] Error 2
==> ERROR: A failure occurred in build().
    Aborting...
==> Removing installed dependencies...
checking dependencies...

Packages (14) blas-3.8.0-2  boost-1.69.0-1  boost-libs-1.69.0-1  cmake-3.13.4-1  fftw-3.3.8-1  hackrf-2018.01.1-1  itpp-4.3.1-3  jsoncpp-1.8.4-2  lapack-3.8.0-2  libnsl-1.2.0-1  libuv-1.26.0-1  rhash-1.3.8-1  rtl-sdr-20180429-1  shared-mime-info-1.12-1

Total Removed Size:  215.95 MiB

:: Do you want to remove these packages? [Y/n] 
:: Running pre-transaction hooks...
(1/1) Removing old entries from the info directory file...
:: Processing package changes...
removing rtl-sdr...
removing itpp...
removing lapack...
removing hackrf...
removing fftw...
removing cmake...
removing shared-mime-info...
removing rhash...
removing libuv...
removing libnsl...
removing jsoncpp...
removing boost...
removing boost-libs...
removing blas...
:: Running post-transaction hooks...
(1/2) Reloading device manager configuration...
  Skipped: Device manager is not running.
(2/2) Arming ConditionNeedsUpdate...
==> ERROR: Build failed, check /chroot/armv7/build/build