==> Synchronizing chroot copy [/chroot/i686/root] -> [build]...done
==> Making package: bulk-extractor 1.5.5-3 (Mon Mar  4 20:53:48 2019)
==> Retrieving sources...
  -> Found bulk_extractor-1.5.5.tar.gz
==> Validating source files with sha512sums...
    bulk_extractor-1.5.5.tar.gz ... Passed
Host and machine ids are equal (03ca1e0d79db47a597e66a5149387887): refusing to link journals
==> Making package: bulk-extractor 1.5.5-3 (Mon 04 Mar 2019 08:53:51 PM EST)
==> Checking runtime dependencies...
==> Installing missing dependencies...
:: There are 4 providers available for java-environment:
:: Repository extra
   1) jdk-openjdk  2) jdk10-openjdk  3) jdk7-openjdk  4) jdk8-openjdk

Enter a number (default=1): 
resolving dependencies...
looking for conflicting packages...
warning: dependency cycle detected:
warning: harfbuzz will be installed before its freetype2 dependency

Packages (25) freetype2-2.9.1-1.2  fuse-common-3.4.1-1.0  fuse2-2.9.9-1.0  giflib-5.1.4-2.0  graphite-1:1.3.13-1.0  harfbuzz-2.3.1-2.0  hicolor-icon-theme-0.17-1  java-environment-common-3-1.2  java-runtime-common-3-1.2  jre-openjdk-11.0.2.u7-1.0  jre-openjdk-headless-11.0.2.u7-1.0  lcms2-2.9-1.2  libjpeg-turbo-2.0.2-1.0  libnet-1.1.6-3.2  libnsl-1.2.0-1.2  libpng-1.6.36-1.0  libtiff-4.0.10-1.0  nspr-4.20-1.1  nss-3.42.1-1.0  python2-2.7.15-4.2  afflib-3.7.17-1  exiv2-0.26-2.1  jdk-openjdk-11.0.2.u7-1.0  libewf-20140608-5.0  tre-0.8.0-5.0

Total Download Size:   117.22 MiB
Total Installed Size:  331.64 MiB

:: Proceed with installation? [Y/n] 
:: Retrieving packages...
downloading nspr-4.20-1.1-i686.pkg.tar.xz...
downloading nss-3.42.1-1.0-i686.pkg.tar.xz...
downloading libnsl-1.2.0-1.2-i686.pkg.tar.xz...
downloading java-runtime-common-3-1.2-any.pkg.tar.xz...
downloading libjpeg-turbo-2.0.2-1.0-i686.pkg.tar.xz...
downloading libtiff-4.0.10-1.0-i686.pkg.tar.xz...
downloading lcms2-2.9-1.2-i686.pkg.tar.xz...
downloading libnet-1.1.6-3.2-i686.pkg.tar.xz...
downloading libpng-1.6.36-1.0-i686.pkg.tar.xz...
downloading graphite-1:1.3.13-1.0-i686.pkg.tar.xz...
downloading harfbuzz-2.3.1-2.0-i686.pkg.tar.xz...
downloading freetype2-2.9.1-1.2-i686.pkg.tar.xz...
downloading jre-openjdk-headless-11.0.2.u7-1.0-i686.pkg.tar.xz...
downloading giflib-5.1.4-2.0-i686.pkg.tar.xz...
downloading jre-openjdk-11.0.2.u7-1.0-i686.pkg.tar.xz...
downloading java-environment-common-3-1.2-any.pkg.tar.xz...
downloading hicolor-icon-theme-0.17-1-any.pkg.tar.xz...
downloading jdk-openjdk-11.0.2.u7-1.0-i686.pkg.tar.xz...
downloading exiv2-0.26-2.1-i686.pkg.tar.xz...
downloading fuse-common-3.4.1-1.0-i686.pkg.tar.xz...
downloading fuse2-2.9.9-1.0-i686.pkg.tar.xz...
downloading python2-2.7.15-4.2-i686.pkg.tar.xz...
downloading tre-0.8.0-5.0-i686.pkg.tar.xz...
downloading libewf-20140608-5.0-i686.pkg.tar.xz...
downloading afflib-3.7.17-1-i686.pkg.tar.xz...
checking keyring...
checking package integrity...
loading package files...
checking for file conflicts...
checking available disk space...
:: Processing package changes...
installing tre...
installing java-runtime-common...
For the complete set of Java binaries to be available in your PATH,
you need to re-login or source /etc/profile.d/jre.sh
Please note that this package does not support forcing JAVA_HOME as former package java-common did
installing nspr...
installing nss...
installing libjpeg-turbo...
installing libtiff...
Optional dependencies for libtiff
    freeglut: for using tiffgt
installing lcms2...
installing libnet...
installing libpng...
installing graphite...
installing harfbuzz...
Optional dependencies for harfbuzz
    cairo: hb-view program
installing freetype2...
installing jre-openjdk-headless...
Optional dependencies for jre-openjdk-headless
    java-rhino: for some JavaScript support
installing giflib...
installing jre-openjdk...
when you use a non-reparenting window manager,
set _JAVA_AWT_WM_NONREPARENTING=1 in /etc/profile.d/jre.sh
Optional dependencies for jre-openjdk
    alsa-lib: for basic sound support
    gtk2: for the Gtk+ 2 look and feel - desktop usage
    gtk3: for the Gtk+ 3 look and feel - desktop usage
installing java-environment-common...
installing hicolor-icon-theme...
installing jdk-openjdk...
installing exiv2...
installing fuse-common...
installing fuse2...
installing libnsl...
installing python2...
Optional dependencies for python2
    tk: for IDLE
    python2-setuptools
    python2-pip
installing afflib...
libtool: finish: PATH="/usr/local/sbin:/usr/local/bin:/usr/bin:/usr/bin/site_perl:/usr/bin/vendor_perl:/usr/bin/core_perl:/usr/bin/site_perl:/usr/bin/vendor_perl:/usr/bin/core_perl:/sbin" ldconfig -n /usr/lib
----------------------------------------------------------------------
Libraries have been installed in:
   /usr/lib

If you ever happen to want to link against installed libraries
in a given directory, LIBDIR, you must either use libtool, and
specify the full pathname of the library, or use the '-LLIBDIR'
flag during linking and do at least one of the following:
   - add LIBDIR to the 'LD_LIBRARY_PATH' environment variable
     during execution
   - add LIBDIR to the 'LD_RUN_PATH' environment variable
     during linking
   - use the '-Wl,-rpath -Wl,LIBDIR' linker flag
   - have your system administrator add LIBDIR to '/etc/ld.so.conf'

See any operating system documentation about shared libraries for
more information, such as the ld(1) and ld.so(8) manual pages.
----------------------------------------------------------------------
libtool: finish: PATH="/usr/local/sbin:/usr/local/bin:/usr/bin:/usr/bin/site_perl:/usr/bin/vendor_perl:/usr/bin/core_perl:/usr/bin/site_perl:/usr/bin/vendor_perl:/usr/bin/core_perl:/sbin" ldconfig -n /usr/lib/python2.7/site-packages
----------------------------------------------------------------------
Libraries have been installed in:
   /usr/lib/python2.7/site-packages

If you ever happen to want to link against installed libraries
in a given directory, LIBDIR, you must either use libtool, and
specify the full pathname of the library, or use the '-LLIBDIR'
flag during linking and do at least one of the following:
   - add LIBDIR to the 'LD_LIBRARY_PATH' environment variable
     during execution
   - add LIBDIR to the 'LD_RUN_PATH' environment variable
     during linking
   - use the '-Wl,-rpath -Wl,LIBDIR' linker flag
   - have your system administrator add LIBDIR to '/etc/ld.so.conf'

See any operating system documentation about shared libraries for
more information, such as the ld(1) and ld.so(8) manual pages.
----------------------------------------------------------------------
installing libewf...
Optional dependencies for libewf
    fuse2: to be able to use ewfmount [installed]
:: Running post-transaction hooks...
(1/2) Reloading device manager configuration...
  Skipped: Device manager is not running.
(2/2) Arming ConditionNeedsUpdate...
==> Checking buildtime dependencies...
==> Retrieving sources...
  -> Found bulk_extractor-1.5.5.tar.gz
==> WARNING: Skipping all source file integrity checks.
==> Extracting sources...
  -> Extracting bulk_extractor-1.5.5.tar.gz with bsdtar
==> Starting prepare()...
==> Starting build()...
checking for a BSD-compatible install... /usr/bin/install -c
checking whether build environment is sane... yes
checking for a thread-safe mkdir -p... /usr/bin/mkdir -p
checking for gawk... gawk
checking whether make sets $(MAKE)... yes
checking whether make supports nested variables... yes
checking whether to enable maintainer-specific portions of Makefiles... no
checking for gcc... gcc
checking whether the C compiler works... yes
checking for C compiler default output file name... a.out
checking for suffix of executables... 
checking whether we are cross compiling... no
checking for suffix of object files... o
checking whether we are using the GNU C compiler... yes
checking whether gcc accepts -g... yes
checking for gcc option to accept ISO C89... none needed
checking for style of include used by make... GNU
checking dependency style of gcc... gcc3
checking for g++... g++
checking whether we are using the GNU C++ compiler... yes
checking whether g++ accepts -g... yes
checking dependency style of g++... gcc3
checking for gcc option to accept ISO C99... none needed
checking whether gcc and cc understand -c and -o together... yes
checking for flex... flex
checking lex output file root... lex.yy
checking lex library... -lfl
checking whether yytext is a pointer... yes
checking whether g++ supports C++11 features by default... yes
checking how to run the C preprocessor... gcc -E
checking for grep that handles long lines and -e... /usr/bin/grep
checking for egrep... /usr/bin/grep -E
checking for ANSI C header files... yes
checking for sys/types.h... yes
checking for sys/stat.h... yes
checking for stdlib.h... yes
checking for string.h... yes
checking for memory.h... yes
checking for strings.h... yes
checking for inttypes.h... yes
checking for stdint.h... yes
checking for unistd.h... yes
checking whether byte ordering is bigendian... no
checking for javac... true
./configure: line 5918: test: javac: unary operator expected
configure: javac 6 or later is not available for compiling BEViewer.  Try 'apt-get install java-1.7.0-openjdk-devel' or 'yum install java-1.7.0-openjdk-devel' or 'port install java-1.7.0-openjdk-devel' or whatever package manager you happen to be using....
checking for jar... true
configure: flex supports -R
configure: Compiling under .
configure: checking /usr/local/include
configure:  *** ADDING /usr/local/include to CPPFLAGS *** 
configure:  *** ADDING /usr/local/lib to LDFLAGS *** 
configure: checking /opt/local/include
configure: checking /sw/include
configure: checking /usr/local/ssl/include
configure:  CPPFLAGS = -D_FORTIFY_SOURCE=2 -I/usr/local/include 
configure:  LDFLAGS = -Wl,-O1,--sort-common,--as-needed,-z,relro -L/usr/local/lib 
C Warnings to test: -MD -Wpointer-arith -Wmissing-declarations -Wmissing-prototypes     -Wshadow -Wwrite-strings -Wcast-align -Waggregate-return     -Wbad-function-cast -Wcast-qual -Wundef -Wredundant-decls -Wdisabled-optimization     -Wfloat-equal -Wmultichar -Wc++-compat -Wmissing-noreturn  -Wall -Wstrict-prototypes
checking whether gcc understands -MD... yes
checking whether gcc understands -Wpointer-arith... yes
checking whether gcc understands -Wmissing-declarations... yes
checking whether gcc understands -Wmissing-prototypes... yes
checking whether gcc understands -Wshadow... yes
checking whether gcc understands -Wwrite-strings... yes
checking whether gcc understands -Wcast-align... yes
checking whether gcc understands -Waggregate-return... yes
checking whether gcc understands -Wbad-function-cast... yes
checking whether gcc understands -Wcast-qual... yes
checking whether gcc understands -Wundef... yes
checking whether gcc understands -Wredundant-decls... yes
checking whether gcc understands -Wdisabled-optimization... yes
checking whether gcc understands -Wfloat-equal... yes
checking whether gcc understands -Wmultichar... yes
checking whether gcc understands -Wc++-compat... yes
checking whether gcc understands -Wmissing-noreturn... yes
checking whether gcc understands -Wall... yes
checking whether gcc understands -Wstrict-prototypes... yes
checking how to run the C++ preprocessor... g++ -E
checking string usability... yes
checking string presence... yes
checking for string... yes
C++ Warnings to test: -Wall -MD -D_FORTIFY_SOURCE=2 -Wpointer-arith     -Wshadow -Wwrite-strings -Wcast-align      -Wredundant-decls -Wdisabled-optimization     -Wfloat-equal -Wmultichar -Wmissing-noreturn     -Woverloaded-virtual -Wsign-promo     -funit-at-a-time  -Weffc++
checking whether g++ understands -Wall... yes
checking whether g++ understands -MD... yes
checking whether g++ understands -D_FORTIFY_SOURCE=2... yes
checking whether g++ understands -Wpointer-arith... yes
checking whether g++ understands -Wshadow... yes
checking whether g++ understands -Wwrite-strings... yes
checking whether g++ understands -Wcast-align... yes
checking whether g++ understands -Wredundant-decls... yes
checking whether g++ understands -Wdisabled-optimization... yes
checking whether g++ understands -Wfloat-equal... yes
checking whether g++ understands -Wmultichar... yes
checking whether g++ understands -Wmissing-noreturn... yes
checking whether g++ understands -Woverloaded-virtual... yes
checking whether g++ understands -Wsign-promo... yes
checking whether g++ understands -funit-at-a-time... yes
checking whether g++ understands -Weffc++... yes
configure: Including dfxml_configure.m4 from dfxml
configure: Note: checks for afflib/afflib.h and libewf.h should be in the caller, so they can be disabled
checking err.h usability... yes
checking err.h presence... yes
checking for err.h... yes
checking expat.h usability... yes
checking expat.h presence... yes
checking for expat.h... yes
checking pwd.h usability... yes
checking pwd.h presence... yes
checking for pwd.h... yes
checking sys/cdefs.h usability... yes
checking sys/cdefs.h presence... yes
checking for sys/cdefs.h... yes
checking sys/mman.h usability... yes
checking sys/mman.h presence... yes
checking for sys/mman.h... yes
checking sys/resource.h usability... yes
checking sys/resource.h presence... yes
checking for sys/resource.h... yes
checking sys/utsname.h usability... yes
checking sys/utsname.h presence... yes
checking for sys/utsname.h... yes
checking for unistd.h... (cached) yes
checking winsock2.h usability... no
checking winsock2.h presence... no
checking for winsock2.h... no
checking for fork... yes
checking for localtime_r... yes
checking for getuid... yes
checking for gethostname... yes
checking for getwpuid... no
checking for getrusage... yes
checking for mkstemp... yes
checking for vasprintf... yes
checking for regcomp... yes
checking exiv2/image.hpp usability... yes
checking exiv2/image.hpp presence... yes
checking for exiv2/image.hpp... yes
checking for git... no
configure: WARNING: git not found
checking openssl/aes.h usability... yes
checking openssl/aes.h presence... yes
checking for openssl/aes.h... yes
checking openssl/bio.h usability... yes
checking openssl/bio.h presence... yes
checking for openssl/bio.h... yes
checking openssl/evp.h usability... yes
checking openssl/evp.h presence... yes
checking for openssl/evp.h... yes
checking openssl/hmac.h usability... yes
checking openssl/hmac.h presence... yes
checking for openssl/hmac.h... yes
checking openssl/md5.h usability... yes
checking openssl/md5.h presence... yes
checking for openssl/md5.h... yes
checking openssl/pem.h usability... yes
checking openssl/pem.h presence... yes
checking for openssl/pem.h... yes
checking openssl/rand.h usability... yes
checking openssl/rand.h presence... yes
checking for openssl/rand.h... yes
checking openssl/rsa.h usability... yes
checking openssl/rsa.h presence... yes
checking for openssl/rsa.h... yes
checking openssl/sha.h usability... yes
checking openssl/sha.h presence... yes
checking for openssl/sha.h... yes
checking for openssl/pem.h... (cached) yes
checking openssl/x509.h usability... yes
checking openssl/x509.h presence... yes
checking for openssl/x509.h... yes
checking for EVP_get_digestbyname in -lcrypto... yes
checking for SSL_library_init in -lssl... no
checking for EVP_get_digestbyname... yes
configure: Including be13_configure.m4 from be13_api
checking for err.h... (cached) yes
checking for pwd.h... (cached) yes
checking for sys/cdefs.h... (cached) yes
checking for sys/mman.h... (cached) yes
checking for sys/resource.h... (cached) yes
checking for sys/utsname.h... (cached) yes
checking for unistd.h... (cached) yes
checking sqlite3.h usability... yes
checking sqlite3.h presence... yes
checking for sqlite3.h... yes
checking for gmtime_r... yes
checking for ishexnumber... no
checking for isxdigit... yes
checking for localtime_r... (cached) yes
checking for unistd.h... no
checking for mmap... yes
checking for err... yes
checking for errx... yes
checking for warn... yes
checking for warnx... yes
checking for pread64... yes
checking for pread... yes
checking for strptime... yes
checking for _lseeki64... no
checking for utimes... yes
checking for sqlite3_libversion in -lsqlite3... yes
checking for sqlite3_create_function_v2... yes
configure: checking for unordered_map
configure:   CXXFLAGS:           -march=i686 -mtune=generic -O2 -pipe -fstack-protector-strong --param=ssp-buffer-size=4 -Wall -MD -D_FORTIFY_SOURCE=2 -Wpointer-arith -Wshadow -Wwrite-strings -Wcast-align -Wredundant-decls -Wdisabled-optimization -Wfloat-equal -Wmultichar -Wmissing-noreturn -Woverloaded-virtual -Wsign-promo -funit-at-a-time -Weffc++
checking unordered_map usability... yes
checking unordered_map presence... yes
checking for unordered_map... yes
checking unordered_set usability... yes
checking unordered_set presence... yes
checking for unordered_set... yes
configure: done
./configure: line 7015: ,: command not found
configure: normal pthreads support
checking Running pthread test from http://www.gnu.org/software/autoconf-archive/ax_pthread.html..... checking build system type... x86_64-unknown-linux-gnu
checking host system type... x86_64-unknown-linux-gnu
checking if compiler needs -Werror to reject unknown flags... no
checking for the pthreads library -lpthreads... no
checking whether pthreads work without any flags... no
checking whether pthreads work with -Kthread... no
checking whether pthreads work with -kthread... no
checking for the pthreads library -llthread... no
checking whether pthreads work with -pthread... yes
checking for joinable pthread attribute... PTHREAD_CREATE_JOINABLE
checking if more special flags are required for pthreads... no
checking for PTHREAD_PRIO_INHERIT... yes
Using settings from
checking for pthread_join in LIBS= with CFLAGS=-pthread... yes
checking if compiler needs -Werror to reject unknown flags... no
checking for joinable pthread attribute... PTHREAD_CREATE_JOINABLE
checking if more special flags are required for pthreads... no
checking for PTHREAD_PRIO_INHERIT... (cached) yes
configure: After pthread test, CFLAGS:   -pthread -march=i686 -mtune=generic -O2 -pipe -fstack-protector-strong --param=ssp-buffer-size=4 -MD -Wpointer-arith -Wmissing-declarations -Wmissing-prototypes -Wshadow -Wwrite-strings -Wcast-align -Waggregate-return -Wbad-function-cast -Wcast-qual -Wundef -Wredundant-decls -Wdisabled-optimization -Wfloat-equal -Wmultichar -Wc++-compat -Wmissing-noreturn -Wall -Wstrict-prototypes
configure: After pthread test, CXXFLAGS: -pthread -march=i686 -mtune=generic -O2 -pipe -fstack-protector-strong --param=ssp-buffer-size=4 -Wall -MD -D_FORTIFY_SOURCE=2 -Wpointer-arith -Wshadow -Wwrite-strings -Wcast-align -Wredundant-decls -Wdisabled-optimization -Wfloat-equal -Wmultichar -Wmissing-noreturn -Woverloaded-virtual -Wsign-promo -funit-at-a-time -Weffc++ 
configure: After pthread test, LDFLAGS: -Wl,-O1,--sort-common,--as-needed,-z,relro -L/usr/local/lib
checking pthread.h usability... yes
checking pthread.h presence... yes
checking for pthread.h... yes
checking for pthread_create in -lpthreadGC2... no
checking for pthread_win32_process_attach_np... no
checking for pthread_win32_process_detach_np... no
checking for pthread_win32_thread_attach_np... no
checking for pthread_win32_thread_detach_np... no
checking for ANSI C header files... (cached) yes
checking for int64_t... yes
checking for special C compiler options needed for large files... no
checking for _FILE_OFFSET_BITS value needed for large files... 64
checking POSIX termios... yes
checking alloca.h usability... yes
checking alloca.h presence... yes
checking for alloca.h... yes
checking dirent.h usability... yes
checking dirent.h presence... yes
checking for dirent.h... yes
checking dlfcn.h usability... yes
checking dlfcn.h presence... yes
checking for dlfcn.h... yes
checking for err.h... (cached) yes
checking errno.h usability... yes
checking errno.h presence... yes
checking for errno.h... yes
checking fcntl.h usability... yes
checking fcntl.h presence... yes
checking for fcntl.h... yes
checking for inttypes.h... (cached) yes
checking libgen.h usability... yes
checking libgen.h presence... yes
checking for libgen.h... yes
checking limits.h usability... yes
checking limits.h presence... yes
checking for limits.h... yes
checking malloc.h usability... yes
checking malloc.h presence... yes
checking for malloc.h... yes
checking mmap.h usability... no
checking mmap.h presence... no
checking for mmap.h... no
checking for pwd.h... (cached) yes
checking signal.h usability... yes
checking signal.h presence... yes
checking for signal.h... yes
checking stdarg.h usability... yes
checking stdarg.h presence... yes
checking for stdarg.h... yes
checking for stdint.h... (cached) yes
checking stdio.h usability... yes
checking stdio.h presence... yes
checking for stdio.h... yes
checking for strings.h... (cached) yes
checking for string.h... (cached) yes
checking for stdlib.h... (cached) yes
checking for sys/cdefs.h... (cached) yes
checking sys/disk.h usability... no
checking sys/disk.h presence... no
checking for sys/disk.h... no
checking sys/fcntl.h usability... yes
checking sys/fcntl.h presence... yes
checking for sys/fcntl.h... yes
checking sys/ioctl.h usability... yes
checking sys/ioctl.h presence... yes
checking for sys/ioctl.h... yes
checking for sys/mman.h... (cached) yes
checking sys/mmap.h usability... no
checking sys/mmap.h presence... no
checking for sys/mmap.h... no
checking sys/mount.h usability... yes
checking sys/mount.h presence... yes
checking for sys/mount.h... yes
checking sys/param.h usability... yes
checking sys/param.h presence... yes
checking for sys/param.h... yes
checking sys/socket.h usability... yes
checking sys/socket.h presence... yes
checking for sys/socket.h... yes
checking for sys/stat.h... (cached) yes
checking for sys/types.h... (cached) yes
checking sys/time.h usability... yes
checking sys/time.h presence... yes
checking for sys/time.h... yes
checking for sys/resource.h... (cached) yes
checking sys/sysctl.h usability... yes
checking sys/sysctl.h presence... yes
checking for sys/sysctl.h... yes
checking time.h usability... yes
checking time.h presence... yes
checking for time.h... yes
checking for unistd.h... (cached) yes
checking windows.h usability... no
checking windows.h presence... no
checking for windows.h... no
checking CoreServices/CoreServices.h usability... no
checking CoreServices/CoreServices.h presence... no
checking for CoreServices/CoreServices.h... no
checking for err... (cached) yes
checking for errx... (cached) yes
checking for getuid... (cached) yes
checking for getpwuid... yes
checking for gethostname... (cached) yes
checking for getrusage... (cached) yes
checking for gmtime_r... (cached) yes
checking for isxdigit... (cached) yes
checking for ishexnumber... (cached) no
checking for le64toh... no
checking for localtime_r... (cached) yes
checking for _lseeki64... (cached) no
checking for inet_ntop... yes
checking for pread64... (cached) yes
checking for pread... (cached) yes
checking for printf... yes
checking for mmap... (cached) yes
checking for munmap... yes
checking for MD5... yes
checking for mkstemp... (cached) yes
checking for mktemp... yes
checking for random... yes
checking for srandom... yes
checking for srandomdev... no
checking for sleep... yes
checking for SleepEx... no
checking for strptime... (cached) yes
checking for usleep... yes
checking for vasprintf... (cached) yes
checking for warn... (cached) yes
checking for warnx... (cached) yes
checking for CreateProcess... no
checking for LoadLibrary... no
checking for IncrementAtomic... no
checking for InterlockedIncrement... no
checking for dlopen in -ldl... yes
checking for dlopen... yes
checking for dlopen_preflight... no
checking arpa/inet.h usability... yes
checking arpa/inet.h presence... yes
checking for arpa/inet.h... yes
checking netinet/in.h usability... yes
checking netinet/in.h presence... yes
checking for netinet/in.h... yes
checking wsipx.h usability... no
checking wsipx.h presence... no
checking for wsipx.h... no
checking for netinet/ip.h... yes
checking for struct sockaddr_in.sin_len... no
checking for uncompress in -lz... yes
checking for expat.h... (cached) yes
checking for XML_ParserCreate in -lexpat... yes
checking for main in -lstdc++... yes
checking regex.h usability... yes
checking regex.h presence... yes
checking for regex.h... yes
checking tre/tre.h usability... yes
checking tre/tre.h presence... yes
checking for tre/tre.h... yes
checking for regcomp in -lregex... no
checking for tre_regcomp in -ltre... yes
checking for regcomp... (cached) yes
checking for tre_regcomp... yes
checking for tre_version... yes
checking for openssl/x509.h... (cached) yes
checking for openssl/pem.h... (cached) yes
configure: afflib is yes
checking afflib/afflib.h usability... yes
checking afflib/afflib.h presence... yes
checking for afflib/afflib.h... yes
checking for af_get_pagesize in -lafflib... yes
configure: libewf is yes
checking libewf.h usability... yes
checking libewf.h presence... yes
checking for libewf.h... yes
checking for libewf_get_version in -lewf... yes
checking for libewf_handle_get_utf8_header_value_notes... no
checking for libewf_error_backtrace_fprint... yes
configure: libewf is now yes
checking for xmlSAXUserParseFile in -lxml2... yes
checking for boostlib >= 1.53... configure: We could not detect the boost libraries (version 1.53 or higher). If you have a staged boost library (still not installed) please specify $BOOST_ROOT in your environment and do not give a PATH to --with-boost option.  If you are sure you have boost installed, then check your version number looking in <boost/version.hpp>. See http://randspringer.de/boost for more documentation.
configure: WARNING: Boost 1.53 or newer is required to build the hashdb scanner
configure: the hashdb scanner will not be built
configure: strchr is not conforming
configure: *************************************
configure: *************************************
configure:   PACKAGE_NAME:     BULK_EXTRACTOR
configure:   PACKAGE_VERSION:  1.5.5
configure:   CC:               gcc
configure:   CXX:              g++
configure:   CPPFLAGS:         -D_FORTIFY_SOURCE=2 -I/usr/local/include -DUTC_OFFSET=-0500
configure:   CFLAGS:           -g     -pthread -march=i686 -mtune=generic -O3 -pipe -fstack-protector-strong --param=ssp-buffer-size=4 -MD -Wpointer-arith -Wmissing-declarations -Wmissing-prototypes -Wshadow -Wwrite-strings -Wcast-align -Waggregate-return -Wbad-function-cast -Wcast-qual -Wundef -Wredundant-decls -Wdisabled-optimization -Wfloat-equal -Wmultichar -Wc++-compat -Wmissing-noreturn -Wall -Wstrict-prototypes -fPIC   -D_FORTIFY_SOURCE=2 
configure:   CXXFLAGS:         -g -pthread -march=i686 -mtune=generic -O3 -pipe -fstack-protector-strong --param=ssp-buffer-size=4 -Wall -MD -D_FORTIFY_SOURCE=2 -Wpointer-arith -Wshadow -Wwrite-strings -Wcast-align -Wredundant-decls -Wdisabled-optimization -Wfloat-equal -Wmultichar -Wmissing-noreturn -Woverloaded-virtual -Wsign-promo -funit-at-a-time -Weffc++  -fPIC -D_FORTIFY_SOURCE=2 
configure:   LIBS:             -lxml2 -lewf -lafflib -ltre -lstdc++ -lexpat -lz -ldl  -lsqlite3 -lcrypto 
configure:   LDFLAGS:          -Wl,-O1,--sort-common,--as-needed,-z,relro -L/usr/local/lib
configure: WARNING: javac for BEViewer is unavailable because one or more requisite components are not available:
javac Version 6 or later must be installed to allow javac support for BEViewer.
checking that generated files are newer than configure... done
configure: creating ./config.status
config.status: creating Makefile
config.status: creating src/Makefile
config.status: creating doc/Makefile
config.status: creating doc/latex_manuals/Makefile
config.status: creating man/Makefile
config.status: creating python/Makefile
config.status: creating plugins/Makefile
config.status: creating specfiles/Makefile
config.status: creating specfiles/bulk_extractor.spec.m4
config.status: creating java_gui/Makefile
config.status: creating tests/Makefile
config.status: creating config.h
config.status: executing depfiles commands
make  all-recursive
make[1]: Entering directory '/build/bulk-extractor/src/bulk_extractor-1.5.5'
Making all in doc
make[2]: Entering directory '/build/bulk-extractor/src/bulk_extractor-1.5.5/doc'
make[2]: Nothing to be done for 'all'.
make[2]: Leaving directory '/build/bulk-extractor/src/bulk_extractor-1.5.5/doc'
Making all in doc/latex_manuals
make[2]: Entering directory '/build/bulk-extractor/src/bulk_extractor-1.5.5/doc/latex_manuals'
echo type \"make doc\" to create documentation
type "make doc" to create documentation
make[2]: Leaving directory '/build/bulk-extractor/src/bulk_extractor-1.5.5/doc/latex_manuals'
Making all in src
make[2]: Entering directory '/build/bulk-extractor/src/bulk_extractor-1.5.5/src'
depbase=`echo bulk_extractor_api.o | sed 's|[^/]*$|.deps/&|;s|\.o$||'`;\
g++ -DHAVE_CONFIG_H -I. -I..  -I../src/be13_api -D_FORTIFY_SOURCE=2 -I/usr/local/include -DUTC_OFFSET=-0500  -g -pthread -march=i686 -mtune=generic -O3 -pipe -fstack-protector-strong --param=ssp-buffer-size=4 -Wall -MD -D_FORTIFY_SOURCE=2 -Wpointer-arith -Wshadow -Wwrite-strings -Wcast-align -Wredundant-decls -Wdisabled-optimization -Wfloat-equal -Wmultichar -Wmissing-noreturn -Woverloaded-virtual -Wsign-promo -funit-at-a-time -Weffc++  -fPIC -D_FORTIFY_SOURCE=2  -MT bulk_extractor_api.o -MD -MP -MF $depbase.Tpo -c -o bulk_extractor_api.o bulk_extractor_api.cpp &&\
mv -f $depbase.Tpo $depbase.Po
In file included from be13_api/feature_recorder.h:60,
                 from be13_api/bulk_extractor_i.h:92,
                 from bulk_extractor.h:166,
                 from bulk_extractor_api.cpp:8:
./dfxml/src/hash_t.h:192:16: error: field ‘mdctx’ has incomplete type ‘EVP_MD_CTX’ {aka ‘evp_md_ctx_st’}
     EVP_MD_CTX mdctx;      /* the context for computing the value */
                ^~~~~
In file included from /usr/include/openssl/evp.h:14,
                 from /usr/include/openssl/hmac.h:15,
                 from ./dfxml/src/hash_t.h:57,
                 from be13_api/feature_recorder.h:60,
                 from be13_api/bulk_extractor_i.h:92,
                 from bulk_extractor.h:166,
                 from bulk_extractor_api.cpp:8:
/usr/include/openssl/ossl_typ.h:92:16: note: forward declaration of ‘EVP_MD_CTX’ {aka ‘struct evp_md_ctx_st’}
 typedef struct evp_md_ctx_st EVP_MD_CTX;
                ^~~~~~~~~~~~~
In file included from be13_api/feature_recorder.h:60,
                 from be13_api/bulk_extractor_i.h:92,
                 from bulk_extractor.h:166,
                 from bulk_extractor_api.cpp:8:
./dfxml/src/hash_t.h: In member function ‘void hash_generator__<md, SIZE>::release()’:
./dfxml/src/hash_t.h:211:6: error: there are no arguments to ‘EVP_MD_CTX_cleanup’ that depend on a template parameter, so a declaration of ‘EVP_MD_CTX_cleanup’ must be available [-fpermissive]
      EVP_MD_CTX_cleanup(&mdctx);
      ^~~~~~~~~~~~~~~~~~
./dfxml/src/hash_t.h:211:6: note: (if you use ‘-fpermissive’, G++ will accept your code, but allowing the use of an undeclared name is deprecated)
In file included from bulk_extractor.h:166,
                 from bulk_extractor_api.cpp:8:
be13_api/bulk_extractor_i.h: In function ‘std::__cxx11::string safe_utf16to8(std::__cxx11::wstring)’:
be13_api/bulk_extractor_i.h:880:19: warning: catching polymorphic type ‘class utf8::invalid_utf16’ by value [-Wcatch-value=]
     } catch(utf8::invalid_utf16){
                   ^~~~~~~~~~~~~
be13_api/bulk_extractor_i.h: In function ‘std::__cxx11::wstring safe_utf8to16(std::__cxx11::string)’:
be13_api/bulk_extractor_i.h:891:19: warning: catching polymorphic type ‘class utf8::invalid_utf8’ by value [-Wcatch-value=]
     } catch(utf8::invalid_utf8){
                   ^~~~~~~~~~~~
In file included from be13_api/feature_recorder.h:60,
                 from be13_api/bulk_extractor_i.h:92,
                 from bulk_extractor.h:166,
                 from bulk_extractor_api.cpp:8:
./dfxml/src/hash_t.h: In instantiation of ‘hash_generator__<md, SIZE>::hash_generator__() [with const EVP_MD* (* md)() = EVP_md5; unsigned int SIZE = 16]’:
./dfxml/src/hash_t.h:253:19:   required from ‘static hash__<md, SIZE> hash_generator__<md, SIZE>::hash_buf(const uint8_t*, size_t) [with const EVP_MD* (* md)() = EVP_md5; unsigned int SIZE = 16; uint8_t = unsigned char; size_t = unsigned int]’
bulk_extractor_api.cpp:53:31:   required from here
./dfxml/src/hash_t.h:205:82: error: using invalid field ‘hash_generator__<md, SIZE>::mdctx’
     hash_generator__():mdctx(),initialized(false),finalized(false),hashed_bytes(0){ }
                                                                                  ^
./dfxml/src/hash_t.h: In instantiation of ‘hash_generator__<md, SIZE>::hash_generator__() [with const EVP_MD* (* md)() = EVP_sha1; unsigned int SIZE = 20]’:
./dfxml/src/hash_t.h:253:19:   required from ‘static hash__<md, SIZE> hash_generator__<md, SIZE>::hash_buf(const uint8_t*, size_t) [with const EVP_MD* (* md)() = EVP_sha1; unsigned int SIZE = 20; uint8_t = unsigned char; size_t = unsigned int]’
bulk_extractor_api.cpp:56:32:   required from here
./dfxml/src/hash_t.h:205:82: error: using invalid field ‘hash_generator__<md, SIZE>::mdctx’
./dfxml/src/hash_t.h: In instantiation of ‘hash_generator__<md, SIZE>::hash_generator__() [with const EVP_MD* (* md)() = EVP_sha256; unsigned int SIZE = 32]’:
./dfxml/src/hash_t.h:253:19:   required from ‘static hash__<md, SIZE> hash_generator__<md, SIZE>::hash_buf(const uint8_t*, size_t) [with const EVP_MD* (* md)() = EVP_sha256; unsigned int SIZE = 32; uint8_t = unsigned char; size_t = unsigned int]’
bulk_extractor_api.cpp:59:34:   required from here
./dfxml/src/hash_t.h:205:82: error: using invalid field ‘hash_generator__<md, SIZE>::mdctx’
./dfxml/src/hash_t.h: In instantiation of ‘void hash_generator__<md, SIZE>::release() [with const EVP_MD* (* md)() = EVP_md5; unsigned int SIZE = 16]’:
./dfxml/src/hash_t.h:207:2:   required from ‘hash_generator__<md, SIZE>::~hash_generator__() [with const EVP_MD* (* md)() = EVP_md5; unsigned int SIZE = 16]’
./dfxml/src/hash_t.h:253:19:   required from ‘static hash__<md, SIZE> hash_generator__<md, SIZE>::hash_buf(const uint8_t*, size_t) [with const EVP_MD* (* md)() = EVP_md5; unsigned int SIZE = 16; uint8_t = unsigned char; size_t = unsigned int]’
bulk_extractor_api.cpp:53:31:   required from here
./dfxml/src/hash_t.h:211:31: error: ‘EVP_MD_CTX_cleanup’ was not declared in this scope
      EVP_MD_CTX_cleanup(&mdctx);
                               ^
./dfxml/src/hash_t.h:211:31: note: suggested alternative: ‘EVP_MD_CTX_create’
      EVP_MD_CTX_cleanup(&mdctx);
                               ^
                               EVP_MD_CTX_create
./dfxml/src/hash_t.h: In instantiation of ‘void hash_generator__<md, SIZE>::release() [with const EVP_MD* (* md)() = EVP_sha1; unsigned int SIZE = 20]’:
./dfxml/src/hash_t.h:207:2:   required from ‘hash_generator__<md, SIZE>::~hash_generator__() [with const EVP_MD* (* md)() = EVP_sha1; unsigned int SIZE = 20]’
./dfxml/src/hash_t.h:253:19:   required from ‘static hash__<md, SIZE> hash_generator__<md, SIZE>::hash_buf(const uint8_t*, size_t) [with const EVP_MD* (* md)() = EVP_sha1; unsigned int SIZE = 20; uint8_t = unsigned char; size_t = unsigned int]’
bulk_extractor_api.cpp:56:32:   required from here
./dfxml/src/hash_t.h:211:31: error: ‘EVP_MD_CTX_cleanup’ was not declared in this scope
./dfxml/src/hash_t.h:211:31: note: suggested alternative: ‘EVP_MD_CTX_create’
      EVP_MD_CTX_cleanup(&mdctx);
                               ^
                               EVP_MD_CTX_create
./dfxml/src/hash_t.h: In instantiation of ‘void hash_generator__<md, SIZE>::release() [with const EVP_MD* (* md)() = EVP_sha256; unsigned int SIZE = 32]’:
./dfxml/src/hash_t.h:207:2:   required from ‘hash_generator__<md, SIZE>::~hash_generator__() [with const EVP_MD* (* md)() = EVP_sha256; unsigned int SIZE = 32]’
./dfxml/src/hash_t.h:253:19:   required from ‘static hash__<md, SIZE> hash_generator__<md, SIZE>::hash_buf(const uint8_t*, size_t) [with const EVP_MD* (* md)() = EVP_sha256; unsigned int SIZE = 32; uint8_t = unsigned char; size_t = unsigned int]’
bulk_extractor_api.cpp:59:34:   required from here
./dfxml/src/hash_t.h:211:31: error: ‘EVP_MD_CTX_cleanup’ was not declared in this scope
./dfxml/src/hash_t.h:211:31: note: suggested alternative: ‘EVP_MD_CTX_create’
      EVP_MD_CTX_cleanup(&mdctx);
                               ^
                               EVP_MD_CTX_create
make[2]: *** [Makefile:1172: bulk_extractor_api.o] Error 1
make[2]: Leaving directory '/build/bulk-extractor/src/bulk_extractor-1.5.5/src'
make[1]: *** [Makefile:474: all-recursive] Error 1
make[1]: Leaving directory '/build/bulk-extractor/src/bulk_extractor-1.5.5'
make: *** [Makefile:412: all] Error 2
==> ERROR: A failure occurred in build().
    Aborting...
==> Removing installed dependencies...
checking dependencies...
warning: dependency cycle detected:
warning: harfbuzz will be removed after its freetype2 dependency

Packages (25) afflib-3.7.17-1  exiv2-0.26-2.1  freetype2-2.9.1-1.2  fuse-common-3.4.1-1.0  fuse2-2.9.9-1.0  giflib-5.1.4-2.0  graphite-1:1.3.13-1.0  harfbuzz-2.3.1-2.0  hicolor-icon-theme-0.17-1  java-environment-common-3-1.2  java-runtime-common-3-1.2  jdk-openjdk-11.0.2.u7-1.0  jre-openjdk-11.0.2.u7-1.0  jre-openjdk-headless-11.0.2.u7-1.0  lcms2-2.9-1.2  libewf-20140608-5.0  libjpeg-turbo-2.0.2-1.0  libnet-1.1.6-3.2  libnsl-1.2.0-1.2  libpng-1.6.36-1.0  libtiff-4.0.10-1.0  nspr-4.20-1.1  nss-3.42.1-1.0  python2-2.7.15-4.2  tre-0.8.0-5.0

Total Removed Size:  331.64 MiB

:: Do you want to remove these packages? [Y/n] 
:: Processing package changes...
removing tre...
removing libewf...
removing jdk-openjdk...
removing jre-openjdk...
removing jre-openjdk-headless...
removing nss...
removing nspr...
removing libnet...
removing lcms2...
removing libtiff...
removing libjpeg-turbo...
removing java-runtime-common...
removing java-environment-common...
removing hicolor-icon-theme...
removing giflib...
removing freetype2...
removing libpng...
removing harfbuzz...
removing graphite...
removing exiv2...
removing afflib...
removing python2...
removing libnsl...
removing fuse2...
removing fuse-common...
:: Running post-transaction hooks...
(1/2) Reloading device manager configuration...
  Skipped: Device manager is not running.
(2/2) Arming ConditionNeedsUpdate...
==> ERROR: Build failed, check /chroot/i686/build/build