==> Synchronizing chroot copy [/chroot/armv7h/root] -> [build]...done
==> Making package: arpon 3.0-3 (Tue Aug 27 07:32:16 2019)
==> Retrieving sources...
  -> Found ArpON-3.0-ng.tar.gz
  -> Found arpon
  -> Found arpon.conf.d
  -> Found arpon.desktop
  -> Found arpon.service
==> Validating source files with sha512sums...
    ArpON-3.0-ng.tar.gz ... Passed
    arpon ... Passed
    arpon.conf.d ... Passed
    arpon.desktop ... Passed
    arpon.service ... Passed
Host and machine ids are equal (2b3dd5a7c7b749ff93431232041f2429): refusing to link journals
==> Making package: arpon 3.0-3 (Tue 27 Aug 2019 07:32:20 AM EDT)
==> Checking runtime dependencies...
==> Installing missing dependencies...
resolving dependencies...
looking for conflicting packages...

Packages (2) libdnet-1.12-10  libnet-1.1.6-3

Total Download Size:   0.16 MiB
Total Installed Size:  0.68 MiB

:: Proceed with installation? [Y/n] 
:: Retrieving packages...
downloading libnet-1.1.6-3-armv7h.pkg.tar.xz...
downloading libdnet-1.12-10-armv7h.pkg.tar.xz...
checking keyring...
checking package integrity...
loading package files...
checking for file conflicts...
checking available disk space...
:: Processing package changes...
installing libdnet...
Optional dependencies for libdnet
    python2
installing libnet...
:: Running post-transaction hooks...
(1/1) Arming ConditionNeedsUpdate...
==> Checking buildtime dependencies...
==> Installing missing dependencies...
resolving dependencies...
looking for conflicting packages...

Packages (6) jsoncpp-1.8.4-2  libnsl-1.2.0-1  libuv-1.31.0-1  rhash-1.3.8-1
             shared-mime-info-1.12-1  cmake-3.15.2-1

Total Download Size:    5.76 MiB
Total Installed Size:  33.78 MiB

:: Proceed with installation? [Y/n] 
:: Retrieving packages...
downloading shared-mime-info-1.12-1-armv7h.pkg.tar.xz...
downloading jsoncpp-1.8.4-2-armv7h.pkg.tar.xz...
downloading libuv-1.31.0-1-armv7h.pkg.tar.xz...
downloading rhash-1.3.8-1-armv7h.pkg.tar.xz...
downloading cmake-3.15.2-1-armv7h.pkg.tar.xz...
checking keyring...
checking package integrity...
loading package files...
checking for file conflicts...
checking available disk space...
:: Processing package changes...
installing shared-mime-info...
installing jsoncpp...
Optional dependencies for jsoncpp
    jsoncpp-doc: documentation
installing libnsl...
installing libuv...
installing rhash...
installing cmake...
Optional dependencies for cmake
    qt5-base: cmake-gui
:: Running post-transaction hooks...
(1/2) Arming ConditionNeedsUpdate...
(2/2) Updating the MIME type database...
==> Retrieving sources...
  -> Found ArpON-3.0-ng.tar.gz
  -> Found arpon
  -> Found arpon.conf.d
  -> Found arpon.desktop
  -> Found arpon.service
==> WARNING: Skipping all source file integrity checks.
==> Extracting sources...
  -> Extracting ArpON-3.0-ng.tar.gz with bsdtar
==> Starting build()...
-- The C compiler identification is GNU 8.3.0
-- Check for working C compiler: /usr/bin/cc
-- Check for working C compiler: /usr/bin/cc -- works
-- Detecting C compiler ABI info
-- Detecting C compiler ABI info - done
-- Detecting C compile features
-- Detecting C compile features - done
-- Building ArpON for Operating System: GNU/Linux
-- Build type: Release
-- Looking for net/ethernet.h
-- Looking for net/ethernet.h - found
-- Looking for net/if.h
-- Looking for net/if.h - found
-- Looking for net/if_arp.h
-- Looking for net/if_arp.h - found
-- Looking for netinet/ether.h
-- Looking for netinet/ether.h - found
-- Looking for netinet/if_ether.h
-- Looking for netinet/if_ether.h - found
-- Looking for netinet/in.h
-- Looking for netinet/in.h - found
-- Looking for arpa/inet.h
-- Looking for arpa/inet.h - found
-- Looking for sys/socket.h
-- Looking for sys/socket.h - found
-- Looking for sys/types.h
-- Looking for sys/types.h - found
-- Looking for sys/stat.h
-- Looking for sys/stat.h - found
-- Looking for sys/time.h
-- Looking for sys/time.h - found
-- Looking for sys/select.h
-- Looking for sys/select.h - found
-- Looking for sys/ioctl.h
-- Looking for sys/ioctl.h - found
-- Looking for stdio.h
-- Looking for stdio.h - found
-- Looking for stdlib.h
-- Looking for stdlib.h - found
-- Looking for stdbool.h
-- Looking for stdbool.h - found
-- Looking for stdarg.h
-- Looking for stdarg.h - found
-- Looking for unistd.h
-- Looking for unistd.h - found
-- Looking for string.h
-- Looking for string.h - found
-- Looking for getopt.h
-- Looking for getopt.h - found
-- Looking for fcntl.h
-- Looking for fcntl.h - found
-- Looking for time.h
-- Looking for time.h - found
-- Looking for signal.h
-- Looking for signal.h - found
-- Looking for errno.h
-- Looking for errno.h - found
-- Looking for assert.h
-- Looking for assert.h - found
-- Found library: Pthreads
-- Found library: Librt
-- Found library: Libpcap
-- Found library: Libnet1
-- Found library: Libdnet
-- Configuring done
-- Generating done
-- Build files have been written to: /build/arpon/src/ArpON-3.0-ng/build
Scanning dependencies of target arpon
[  5%] Building C object src/CMakeFiles/arpon.dir/arpca.c.o
In function ‘arpca_add’,
    inlined from ‘arpca_overwrite’ at /build/arpon/src/ArpON-3.0-ng/src/arpca.c:373:13:
/build/arpon/src/ArpON-3.0-ng/src/arpca.c:439:9: error: strncpy’ specified bound 16 equals destination size [-Werror=stringop-truncation]
         strncpy(ar.arp_dev, interface, IF_NAMESIZE);
         ^~~~~~~~~~~~~~~~~~~~~~~~~~~~~~~~~~~~~~~~~~~
cc1: all warnings being treated as errors
make[2]: *** [src/CMakeFiles/arpon.dir/build.make:63: src/CMakeFiles/arpon.dir/arpca.c.o] Error 1
make[1]: *** [CMakeFiles/Makefile2:165: src/CMakeFiles/arpon.dir/all] Error 2
make: *** [Makefile:130: all] Error 2
==> ERROR: A failure occurred in build().
    Aborting...
==> Removing installed dependencies...
checking dependencies...

Packages (8) cmake-3.15.2-1  jsoncpp-1.8.4-2  libdnet-1.12-10  libnet-1.1.6-3
             libnsl-1.2.0-1  libuv-1.31.0-1  rhash-1.3.8-1
             shared-mime-info-1.12-1

Total Removed Size:  34.46 MiB

:: Do you want to remove these packages? [Y/n] 
:: Processing package changes...
removing libnet...
removing libdnet...
removing cmake...
removing shared-mime-info...
removing rhash...
removing libuv...
removing libnsl...
removing jsoncpp...
:: Running post-transaction hooks...
(1/1) Arming ConditionNeedsUpdate...
==> ERROR: Build failed, check /chroot/armv7h/build/build