==> Synchronizing chroot copy [/chroot/armv7/root] -> [build]...done
==> Making package: argus-clients 3.0.8.2-3 (Tue Aug 27 07:28:30 2019)
==> Retrieving sources...
  -> Found argus-clients-3.0.8.2.tar.gz
==> Validating source files with sha512sums...
    argus-clients-3.0.8.2.tar.gz ... Passed
Host and machine ids are equal (508bc9faf65540dfb4fb1551fd5fdc0a): refusing to link journals
==> Making package: argus-clients 3.0.8.2-3 (Tue 27 Aug 2019 07:28:37 AM EDT)
==> Checking runtime dependencies...
==> Installing missing dependencies...
resolving dependencies...
looking for conflicting packages...

Packages (2) geoip-database-20180403-1  geoip-1.6.12-1

Total Download Size:   1.23 MiB
Total Installed Size:  3.70 MiB

:: Proceed with installation? [Y/n] 
:: Retrieving packages...
downloading geoip-database-20180403-1-any.pkg.tar.xz...
downloading geoip-1.6.12-1-armv7h.pkg.tar.xz...
checking keyring...
checking package integrity...
loading package files...
checking for file conflicts...
checking available disk space...
:: Processing package changes...
installing geoip-database...
installing geoip...
Optional dependencies for geoip
    geoip-database-extra: city/ASN databases (not needed for country lookups)
:: Running post-transaction hooks...
(1/1) Arming ConditionNeedsUpdate...
==> Checking buildtime dependencies...
==> Retrieving sources...
  -> Found argus-clients-3.0.8.2.tar.gz
==> WARNING: Skipping all source file integrity checks.
==> Extracting sources...
  -> Extracting argus-clients-3.0.8.2.tar.gz with bsdtar
==> Starting build()...
checking build system type... armv7l-unknown-linux-gnueabihf
checking host system type... armv7l-unknown-linux-gnueabihf
checking target system type... armv7l-unknown-linux-gnueabihf
checking for standard perl installation... /usr/bin/perl
checking for gcc... gcc
checking whether the C compiler works... yes
checking for C compiler default output file name... a.out
checking for suffix of executables... 
checking whether we are cross compiling... no
checking for suffix of object files... o
checking whether we are using the GNU C compiler... yes
checking whether gcc accepts -g... yes
checking for gcc option to accept ISO C89... none needed
checking gcc version... (cached) 0
checking whether ln -s works... yes
checking for flex... flex
checking lex output file root... lex.yy
checking lex library... -lfl
checking whether yytext is a pointer... yes
checking for a BSD-compatible install... /usr/bin/install -c
checking for ranlib... ranlib
checking for bison... bison -y
checking for ranlib... ranlib
checking for flex... flex
checking for flex 2.4 or higher... yes
checking for bison... bison
checking how to run the C preprocessor... gcc -E
checking for grep that handles long lines and -e... /usr/bin/grep
checking for egrep... /usr/bin/grep -E
checking for ANSI C header files... yes
checking for sys/types.h... yes
checking for sys/stat.h... yes
checking for stdlib.h... yes
checking for string.h... yes
checking for memory.h... yes
checking for strings.h... yes
checking for inttypes.h... yes
checking for stdint.h... yes
checking for unistd.h... yes
checking readline/readline.h usability... yes
checking readline/readline.h presence... yes
checking for readline/readline.h... yes
checking whether rl_event_hook is declared... yes
checking whether rl_catch_signals is declared... yes
checking whether rl_done is declared... yes
checking whether rl_set_keyboard_input_timeout is declared... yes
checking whether rl_replace_line is declared... yes
checking whether rl_delete_text is declared... yes
checking whether rl_resize_terminal is declared... yes
checking whether rl_save_prompt is declared... yes
readline test finished cppflags -D_FORTIFY_SOURCE=2 ldflags -Wl,-O1,--sort-common,--as-needed,-z,relro 
checking sasl/sasl.h usability... yes
checking sasl/sasl.h presence... yes
checking for sasl/sasl.h... yes
checking sasl/saslutil.h usability... yes
checking sasl/saslutil.h presence... yes
checking for sasl/saslutil.h... yes
checking for prop_get in -lsasl2... yes
checking for mysql... no
checking zlib.h usability... yes
checking zlib.h presence... yes
checking for zlib.h... yes
checking for uncompress in -lz... yes
checking for local ft library... not found
checking for ft-config... no
checking for main in -lft... no
checking for extraneous ft header directories... checking for pcre library... checking for pcre-config... pcre-config
checking for dirent.h that defines DIR... yes
checking for library containing opendir... none required
checking for ANSI C header files... (cached) yes
checking for sys/wait.h that is POSIX.1 compatible... yes
checking for sys/types.h... (cached) yes
checking sys/sockio.h usability... no
checking sys/sockio.h presence... no
checking for sys/sockio.h... no
checking sys/file.h usability... yes
checking sys/file.h presence... yes
checking for sys/file.h... yes
checking for string.h... (cached) yes
checking fcntl.h usability... yes
checking fcntl.h presence... yes
checking for fcntl.h... yes
checking syslog.h usability... yes
checking syslog.h presence... yes
checking for syslog.h... yes
checking arpa/inet.h usability... yes
checking arpa/inet.h presence... yes
checking for arpa/inet.h... yes
checking for fcntl.h... (cached) yes
checking for inttypes.h... (cached) yes
checking limits.h usability... yes
checking limits.h presence... yes
checking for limits.h... yes
checking libintl.h usability... yes
checking libintl.h presence... yes
checking for libintl.h... yes
checking malloc.h usability... yes
checking malloc.h presence... yes
checking for malloc.h... yes
checking for memory.h... (cached) yes
checking netdb.h usability... yes
checking netdb.h presence... yes
checking for netdb.h... yes
checking netinet/in.h usability... yes
checking netinet/in.h presence... yes
checking for netinet/in.h... yes
checking net/if_dl.h usability... no
checking net/if_dl.h presence... no
checking for net/if_dl.h... no
checking for stdlib.h... (cached) yes
checking stddef.h usability... yes
checking stddef.h presence... yes
checking for stddef.h... yes
checking for string.h... (cached) yes
checking for strings.h... (cached) yes
checking for sys/file.h... (cached) yes
checking sys/ioctl.h usability... yes
checking sys/ioctl.h presence... yes
checking for sys/ioctl.h... yes
checking sys/param.h usability... yes
checking sys/param.h presence... yes
checking for sys/param.h... yes
checking sys/socket.h usability... yes
checking sys/socket.h presence... yes
checking for sys/socket.h... yes
checking sys/mount.h usability... yes
checking sys/mount.h presence... yes
checking for sys/mount.h... yes
checking sys/time.h usability... yes
checking sys/time.h presence... yes
checking for sys/time.h... yes
checking sys/vfs.h usability... yes
checking sys/vfs.h presence... yes
checking for sys/vfs.h... yes
checking for syslog.h... (cached) yes
checking termios.h usability... yes
checking termios.h presence... yes
checking for termios.h... yes
checking for unistd.h... (cached) yes
checking values.h usability... yes
checking values.h presence... yes
checking for values.h... yes
checking ifaddrs.h usability... yes
checking ifaddrs.h presence... yes
checking for ifaddrs.h... yes
checking for an ANSI C-conforming const... yes
checking for inline... inline
checking for special C compiler options needed for large files... no
checking for _FILE_OFFSET_BITS value needed for large files... 64
checking if unaligned accesses fail... yes
checking for int8_t... yes
checking for uint8_t... yes
checking for int16_t... yes
checking for uint16_t... yes
checking for int32_t... yes
checking for uint32_t... yes
checking for uint64_t... yes
checking for uid_t in sys/types.h... yes
checking for pid_t... yes
checking for size_t... yes
checking whether time.h and sys/time.h may both be included... yes
checking whether struct tm is in sys/time.h or time.h... time.h
checking for struct tm.tm_zone... yes
checking for working alloca.h... yes
checking for alloca... yes
checking for vprintf... yes
checking for _doprnt... no
checking whether closedir returns void... no
checking for error_at_line... yes
checking vfork.h usability... no
checking vfork.h presence... no
checking for vfork.h... no
checking for fork... yes
checking for vfork... yes
checking for working fork... yes
checking for working vfork... (cached) yes
checking whether gcc needs -traditional... no
checking for stdlib.h... (cached) yes
checking for GNU libc compatible malloc... yes
checking for working memcmp... yes
checking for sys/time.h... (cached) yes
checking for unistd.h... (cached) yes
checking for alarm... yes
checking for working mktime... yes
checking for stdlib.h... (cached) yes
checking for GNU libc compatible realloc... yes
checking sys/select.h usability... yes
checking sys/select.h presence... yes
checking for sys/select.h... yes
checking for sys/socket.h... (cached) yes
checking types of arguments for select... int,fd_set *,struct timeval *
checking return type of signal handlers... void
checking whether lstat correctly handles trailing slash... yes
checking whether stat accepts an empty string... no
checking for strftime... yes
checking for working strtod... yes
checking for backtrace... yes
checking for openlog... yes
checking for syslog... yes
checking for vfprintf... yes
checking for strlcpy... no
checking for strftime... (cached) yes
checking for inet_aton... yes
checking for setlinebuf... yes
checking for strerror... yes
checking for strtof... yes
checking for floorf... no
checking for remainderf... no
checking for timegm... yes
checking for vsnprintf... yes
checking for snprintf... yes
checking for library containing gethostbyname... none required
checking for library containing socket... none required
checking for library containing putmsg... none required
checking for ether_hostton... yes
checking for getaddrinfo... yes
checking for gethostname... yes
checking for alarm... (cached) yes
checking for bzero... yes
checking for endgrent... yes
checking for endpwent... yes
checking for floor... no
checking for gethostbyaddr... yes
checking for gethostbyname... yes
checking for getpass... yes
checking for gettimeofday... yes
checking for inet_ntoa... yes
checking for isascii... yes
checking for localtime_r... yes
checking for memchr... yes
checking for memmove... yes
checking for memset... yes
checking for mkdir... yes
checking for modf... yes
checking for pow... no
checking for putenv... yes
checking for realpath... yes
checking for regcomp... yes
checking for select... yes
checking for setenv... yes
checking for socket... yes
checking for sqrt... no
checking for strcasecmp... yes
checking for strchr... yes
checking for strdup... yes
checking for strerror... (cached) yes
checking for strlcat... no
checking for strncasecmp... yes
checking for strpbrk... yes
checking for strerror... (cached) yes
checking for strrchr... yes
checking for strstr... yes
checking for strtol... yes
checking for strtof... (cached) yes
checking for srandomdev... no
checking for tzset... yes
checking for .threads... yes
checking for sched_get_priority_min... yes
checking for local tcp_wrappers library... not found
checking for system tcp_wrappers library... no
checking for xdrmem_create... no
checking ncurses.h usability... yes
checking ncurses.h presence... yes
checking for ncurses.h... yes
checking for initscr in -lncurses... yes
checking for GeoIP_open in -lGeoIP... yes
checking tm_gmtoff in struct tm... yes
checking sys_errlist in stdio.h... yes
configure: creating ./config.status
config.status: creating Makefile
config.status: creating ./common/Makefile
config.status: creating ./include/Makefile
config.status: creating ./clients/Makefile
config.status: creating ./lib/argus-clients.pc
config.status: creating ./examples/Makefile
config.status: creating ./examples/raconvert/Makefile
config.status: creating ./examples/radark/Makefile
config.status: creating ./examples/radecode/Makefile
config.status: creating ./examples/radump/Makefile
config.status: creating ./examples/raevent/Makefile
config.status: creating ./examples/rafilter/Makefile
config.status: creating ./examples/ragraph/Makefile
config.status: creating ./examples/ragrep/Makefile
config.status: creating ./examples/rahisto/Makefile
config.status: creating ./examples/rahosts/Makefile
config.status: creating ./examples/ralabel/Makefile
config.status: creating ./examples/rapath/Makefile
config.status: creating ./examples/rapolicy/Makefile
config.status: creating ./examples/raports/Makefile
config.status: creating ./examples/rarpwatch/Makefile
config.status: creating ./examples/raservices/Makefile
config.status: creating ./examples/rastream/Makefile
config.status: creating ./examples/rastrip/Makefile
config.status: creating ./examples/ratop/Makefile
config.status: creating ./examples/ratimerange/Makefile
config.status: creating ./examples/ratemplate/Makefile
config.status: creating include/argus_config.h
making in ./common
make[1]: Entering directory '/build/argus-clients/src/argus-clients-3.0.8.2/common'
gcc -O -march=armv7-a -mfloat-abi=hard -mfpu=vfpv3-d16 -O2 -pipe -fstack-protector --param=ssp-buffer-size=4 -I. -I../include  -D_FORTIFY_SOURCE=2   -DHAVE_CONFIG_H -DARGUS_SYSLOG -c ./argus_main.c
rm -f ../lib/argus_parse.a; ar qc ../lib/argus_parse.a argus_main.o
ranlib ../lib/argus_parse.a
gcc -O -march=armv7-a -mfloat-abi=hard -mfpu=vfpv3-d16 -O2 -pipe -fstack-protector --param=ssp-buffer-size=4 -I. -I../include  -D_FORTIFY_SOURCE=2   -DHAVE_CONFIG_H -DARGUS_SYSLOG -c ./argus_code.c
gcc -O -march=armv7-a -mfloat-abi=hard -mfpu=vfpv3-d16 -O2 -pipe -fstack-protector --param=ssp-buffer-size=4 -I. -I../include  -D_FORTIFY_SOURCE=2   -DHAVE_CONFIG_H -DARGUS_SYSLOG -c ./argus_filter.c
In file included from ./argus_filter.c:121:
../include/argus_filter.h:162:34: warning: inline function ‘lookup_protoid’ declared but never defined
 extern inline struct protoidmem *lookup_protoid(const unsigned char *);
                                  ^~~~~~~~~~~~~~
../include/argus_filter.h:161:32: warning: inline function ‘lookup_nsap’ declared but never defined
 extern inline struct enamemem *lookup_nsap(const unsigned char *);
                                ^~~~~~~~~~~
gcc -O -march=armv7-a -mfloat-abi=hard -mfpu=vfpv3-d16 -O2 -pipe -fstack-protector --param=ssp-buffer-size=4 -I. -I../include  -D_FORTIFY_SOURCE=2   -DHAVE_CONFIG_H -DARGUS_SYSLOG -c ./argus_util.c
./argus_util.c:90:10: fatal error: rpc/types.h: No such file or directory
 #include <rpc/types.h>
          ^~~~~~~~~~~~~
compilation terminated.
make[1]: *** [Makefile:73: argus_util.o] Error 1
make[1]: Leaving directory '/build/argus-clients/src/argus-clients-3.0.8.2/common'
making in ./include
make[1]: Entering directory '/build/argus-clients/src/argus-clients-3.0.8.2/include'
make[1]: Nothing to be done for 'all'.
make[1]: Leaving directory '/build/argus-clients/src/argus-clients-3.0.8.2/include'
making in ./clients
make[1]: Entering directory '/build/argus-clients/src/argus-clients-3.0.8.2/clients'
gcc -O -march=armv7-a -mfloat-abi=hard -mfpu=vfpv3-d16 -O2 -pipe -fstack-protector --param=ssp-buffer-size=4 -I. -I../include -I../common  -D_FORTIFY_SOURCE=2  -DHAVE_CONFIG_H -c ./ra.c
make[1]: *** No rule to make target '../lib/argus_common.a', needed by '../bin/ra'.  Stop.
make[1]: Leaving directory '/build/argus-clients/src/argus-clients-3.0.8.2/clients'
making in ./examples
make[1]: Entering directory '/build/argus-clients/src/argus-clients-3.0.8.2/examples'
making in ./raconvert
make[2]: Entering directory '/build/argus-clients/src/argus-clients-3.0.8.2/examples/raconvert'
gcc -O -march=armv7-a -mfloat-abi=hard -mfpu=vfpv3-d16 -O2 -pipe -fstack-protector --param=ssp-buffer-size=4 -I. -I../../include -I../../common -D_FORTIFY_SOURCE=2 -DHAVE_CONFIG_H -c ./raconvert.c
./raconvert.c: In function ‘ArgusClientInit’:
./raconvert.c:306:70: warning: iteration 1 invokes undefined behavior [-Waggressive-loop-optimizations]
                  if (!(strncasecmp (mode->mode, RaConvertDaemonModes[x], 3))) {
                                                 ~~~~~~~~~~~~~~~~~~~~^~~

./raconvert.c:305:16: note: within this loop
                for (x = 0, ind = -1; x < RASCII_MAXDEBUG; x++) {
                ^~~
make[2]: *** No rule to make target '../../lib/argus_common.a', needed by '../../bin/raconvert'.  Stop.
make[2]: Leaving directory '/build/argus-clients/src/argus-clients-3.0.8.2/examples/raconvert'
making in ./radark
make[2]: Entering directory '/build/argus-clients/src/argus-clients-3.0.8.2/examples/radark'
sed 's+@PERLBIN@+/usr/bin/perl+' radark.pl > ../../bin/radark
chmod +x ../../bin/radark
make[2]: Leaving directory '/build/argus-clients/src/argus-clients-3.0.8.2/examples/radark'
making in ./radecode
make[2]: Entering directory '/build/argus-clients/src/argus-clients-3.0.8.2/examples/radecode'
sed 's+@BINDIR@+/usr/bin+' radecode.pl | \
sed 's+@PERLBIN@+/usr/bin/perl+' > ../../bin/radecode
chmod +x ../../bin/radecode
make[2]: Leaving directory '/build/argus-clients/src/argus-clients-3.0.8.2/examples/radecode'
making in ./radump
make[2]: Entering directory '/build/argus-clients/src/argus-clients-3.0.8.2/examples/radump'
gcc -O -march=armv7-a -mfloat-abi=hard -mfpu=vfpv3-d16 -O2 -pipe -fstack-protector --param=ssp-buffer-size=4 -I. -I../../include -I../../common -D_FORTIFY_SOURCE=2 -DHAVE_CONFIG_H -c ./radump.c
gcc -O -march=armv7-a -mfloat-abi=hard -mfpu=vfpv3-d16 -O2 -pipe -fstack-protector --param=ssp-buffer-size=4 -I. -I../../include -I../../common -D_FORTIFY_SOURCE=2 -DHAVE_CONFIG_H -c ./print-aodv.c
gcc -O -march=armv7-a -mfloat-abi=hard -mfpu=vfpv3-d16 -O2 -pipe -fstack-protector --param=ssp-buffer-size=4 -I. -I../../include -I../../common -D_FORTIFY_SOURCE=2 -DHAVE_CONFIG_H -c ./print-arp.c
gcc -O -march=armv7-a -mfloat-abi=hard -mfpu=vfpv3-d16 -O2 -pipe -fstack-protector --param=ssp-buffer-size=4 -I. -I../../include -I../../common -D_FORTIFY_SOURCE=2 -DHAVE_CONFIG_H -c ./print-beep.c
gcc -O -march=armv7-a -mfloat-abi=hard -mfpu=vfpv3-d16 -O2 -pipe -fstack-protector --param=ssp-buffer-size=4 -I. -I../../include -I../../common -D_FORTIFY_SOURCE=2 -DHAVE_CONFIG_H -c ./print-bfd.c
gcc -O -march=armv7-a -mfloat-abi=hard -mfpu=vfpv3-d16 -O2 -pipe -fstack-protector --param=ssp-buffer-size=4 -I. -I../../include -I../../common -D_FORTIFY_SOURCE=2 -DHAVE_CONFIG_H -c ./print-bgp.c
gcc -O -march=armv7-a -mfloat-abi=hard -mfpu=vfpv3-d16 -O2 -pipe -fstack-protector --param=ssp-buffer-size=4 -I. -I../../include -I../../common -D_FORTIFY_SOURCE=2 -DHAVE_CONFIG_H -c ./print-bootp.c
gcc -O -march=armv7-a -mfloat-abi=hard -mfpu=vfpv3-d16 -O2 -pipe -fstack-protector --param=ssp-buffer-size=4 -I. -I../../include -I../../common -D_FORTIFY_SOURCE=2 -DHAVE_CONFIG_H -c ./print-domain.c
gcc -O -march=armv7-a -mfloat-abi=hard -mfpu=vfpv3-d16 -O2 -pipe -fstack-protector --param=ssp-buffer-size=4 -I. -I../../include -I../../common -D_FORTIFY_SOURCE=2 -DHAVE_CONFIG_H -c ./print-krb.c
gcc -O -march=armv7-a -mfloat-abi=hard -mfpu=vfpv3-d16 -O2 -pipe -fstack-protector --param=ssp-buffer-size=4 -I. -I../../include -I../../common -D_FORTIFY_SOURCE=2 -DHAVE_CONFIG_H -c ./print-ldp.c
gcc -O -march=armv7-a -mfloat-abi=hard -mfpu=vfpv3-d16 -O2 -pipe -fstack-protector --param=ssp-buffer-size=4 -I. -I../../include -I../../common -D_FORTIFY_SOURCE=2 -DHAVE_CONFIG_H -c ./print-l2tp.c
gcc -O -march=armv7-a -mfloat-abi=hard -mfpu=vfpv3-d16 -O2 -pipe -fstack-protector --param=ssp-buffer-size=4 -I. -I../../include -I../../common -D_FORTIFY_SOURCE=2 -DHAVE_CONFIG_H -c ./print-lmp.c
gcc -O -march=armv7-a -mfloat-abi=hard -mfpu=vfpv3-d16 -O2 -pipe -fstack-protector --param=ssp-buffer-size=4 -I. -I../../include -I../../common -D_FORTIFY_SOURCE=2 -DHAVE_CONFIG_H -c ./print-msdp.c
gcc -O -march=armv7-a -mfloat-abi=hard -mfpu=vfpv3-d16 -O2 -pipe -fstack-protector --param=ssp-buffer-size=4 -I. -I../../include -I../../common -D_FORTIFY_SOURCE=2 -DHAVE_CONFIG_H -c ./print-ntp.c
gcc -O -march=armv7-a -mfloat-abi=hard -mfpu=vfpv3-d16 -O2 -pipe -fstack-protector --param=ssp-buffer-size=4 -I. -I../../include -I../../common -D_FORTIFY_SOURCE=2 -DHAVE_CONFIG_H -c ./print-pim.c
gcc -O -march=armv7-a -mfloat-abi=hard -mfpu=vfpv3-d16 -O2 -pipe -fstack-protector --param=ssp-buffer-size=4 -I. -I../../include -I../../common -D_FORTIFY_SOURCE=2 -DHAVE_CONFIG_H -c ./print-pptp.c
gcc -O -march=armv7-a -mfloat-abi=hard -mfpu=vfpv3-d16 -O2 -pipe -fstack-protector --param=ssp-buffer-size=4 -I. -I../../include -I../../common -D_FORTIFY_SOURCE=2 -DHAVE_CONFIG_H -c ./print-snmp.c
gcc -O -march=armv7-a -mfloat-abi=hard -mfpu=vfpv3-d16 -O2 -pipe -fstack-protector --param=ssp-buffer-size=4 -I. -I../../include -I../../common -D_FORTIFY_SOURCE=2 -DHAVE_CONFIG_H -c ./print-syslog.c
gcc -O -march=armv7-a -mfloat-abi=hard -mfpu=vfpv3-d16 -O2 -pipe -fstack-protector --param=ssp-buffer-size=4 -I. -I../../include -I../../common -D_FORTIFY_SOURCE=2 -DHAVE_CONFIG_H -c ./print-rip.c
gcc -O -march=armv7-a -mfloat-abi=hard -mfpu=vfpv3-d16 -O2 -pipe -fstack-protector --param=ssp-buffer-size=4 -I. -I../../include -I../../common -D_FORTIFY_SOURCE=2 -DHAVE_CONFIG_H -c ./print-telnet.c
gcc -O -march=armv7-a -mfloat-abi=hard -mfpu=vfpv3-d16 -O2 -pipe -fstack-protector --param=ssp-buffer-size=4 -I. -I../../include -I../../common -D_FORTIFY_SOURCE=2 -DHAVE_CONFIG_H -c ./print-tftp.c
gcc -O -march=armv7-a -mfloat-abi=hard -mfpu=vfpv3-d16 -O2 -pipe -fstack-protector --param=ssp-buffer-size=4 -I. -I../../include -I../../common -D_FORTIFY_SOURCE=2 -DHAVE_CONFIG_H -c ./print-isoclns.c
gcc -O -march=armv7-a -mfloat-abi=hard -mfpu=vfpv3-d16 -O2 -pipe -fstack-protector --param=ssp-buffer-size=4 -I. -I../../include -I../../common -D_FORTIFY_SOURCE=2 -DHAVE_CONFIG_H -c ./print-ether.c
gcc -O -march=armv7-a -mfloat-abi=hard -mfpu=vfpv3-d16 -O2 -pipe -fstack-protector --param=ssp-buffer-size=4 -I. -I../../include -I../../common -D_FORTIFY_SOURCE=2 -DHAVE_CONFIG_H -c ./print-timed.c
gcc -O -march=armv7-a -mfloat-abi=hard -mfpu=vfpv3-d16 -O2 -pipe -fstack-protector --param=ssp-buffer-size=4 -I. -I../../include -I../../common -D_FORTIFY_SOURCE=2 -DHAVE_CONFIG_H -c ./print-radius.c
gcc -O -march=armv7-a -mfloat-abi=hard -mfpu=vfpv3-d16 -O2 -pipe -fstack-protector --param=ssp-buffer-size=4 -I. -I../../include -I../../common -D_FORTIFY_SOURCE=2 -DHAVE_CONFIG_H -c ./print-rx.c
gcc -O -march=armv7-a -mfloat-abi=hard -mfpu=vfpv3-d16 -O2 -pipe -fstack-protector --param=ssp-buffer-size=4 -I. -I../../include -I../../common -D_FORTIFY_SOURCE=2 -DHAVE_CONFIG_H -c ./print-smb.c
gcc -O -march=armv7-a -mfloat-abi=hard -mfpu=vfpv3-d16 -O2 -pipe -fstack-protector --param=ssp-buffer-size=4 -I. -I../../include -I../../common -D_FORTIFY_SOURCE=2 -DHAVE_CONFIG_H -c ./print-stp.c
gcc -O -march=armv7-a -mfloat-abi=hard -mfpu=vfpv3-d16 -O2 -pipe -fstack-protector --param=ssp-buffer-size=4 -I. -I../../include -I../../common -D_FORTIFY_SOURCE=2 -DHAVE_CONFIG_H -c ./print-isakmp.c
gcc -O -march=armv7-a -mfloat-abi=hard -mfpu=vfpv3-d16 -O2 -pipe -fstack-protector --param=ssp-buffer-size=4 -I. -I../../include -I../../common -D_FORTIFY_SOURCE=2 -DHAVE_CONFIG_H -c ./print-igmp.c
gcc -O -march=armv7-a -mfloat-abi=hard -mfpu=vfpv3-d16 -O2 -pipe -fstack-protector --param=ssp-buffer-size=4 -I. -I../../include -I../../common -D_FORTIFY_SOURCE=2 -DHAVE_CONFIG_H -c ./print-dvmrp.c
gcc -O -march=armv7-a -mfloat-abi=hard -mfpu=vfpv3-d16 -O2 -pipe -fstack-protector --param=ssp-buffer-size=4 -I. -I../../include -I../../common -D_FORTIFY_SOURCE=2 -DHAVE_CONFIG_H -c ./smbutil.c
gcc -O -march=armv7-a -mfloat-abi=hard -mfpu=vfpv3-d16 -O2 -pipe -fstack-protector --param=ssp-buffer-size=4 -I. -I../../include -I../../common -D_FORTIFY_SOURCE=2 -DHAVE_CONFIG_H -c ./gmpls.c
make[2]: *** No rule to make target '../../lib/argus_common.a', needed by '../../bin/radump'.  Stop.
make[2]: Leaving directory '/build/argus-clients/src/argus-clients-3.0.8.2/examples/radump'
making in ./raevent
make[2]: Entering directory '/build/argus-clients/src/argus-clients-3.0.8.2/examples/raevent'
gcc -O -march=armv7-a -mfloat-abi=hard -mfpu=vfpv3-d16 -O2 -pipe -fstack-protector --param=ssp-buffer-size=4 -I. -I../../include -I../../common -D_FORTIFY_SOURCE=2 -DHAVE_CONFIG_H -c ./raevent.c
make[2]: *** No rule to make target '../../lib/argus_common.a', needed by '../../bin/raevent'.  Stop.
make[2]: Leaving directory '/build/argus-clients/src/argus-clients-3.0.8.2/examples/raevent'
making in ./rafilter
make[2]: Entering directory '/build/argus-clients/src/argus-clients-3.0.8.2/examples/rafilter'
gcc -O -march=armv7-a -mfloat-abi=hard -mfpu=vfpv3-d16 -O2 -pipe -fstack-protector --param=ssp-buffer-size=4 -I. -I../../include -I../../common -D_FORTIFY_SOURCE=2 -DHAVE_CONFIG_H -c ./rafilteraddr.c
make[2]: *** No rule to make target '../../lib/argus_common.a', needed by '../../bin/rafilteraddr'.  Stop.
make[2]: Leaving directory '/build/argus-clients/src/argus-clients-3.0.8.2/examples/rafilter'
making in ./ragraph
make[2]: Entering directory '/build/argus-clients/src/argus-clients-3.0.8.2/examples/ragraph'
sed 's+@BINDIR@+/usr/bin+' ragraph.pl | \
sed 's+@PERLBIN@+/usr/bin/perl+' > ../../bin/ragraph
chmod +x ../../bin/ragraph
sed 's+@BINDIR@+/usr/bin+' raplot.pl | \
sed 's+@PERLBIN@+/usr/bin/perl+' > ../../bin/raplot
chmod +x ../../bin/raplot
make[2]: Leaving directory '/build/argus-clients/src/argus-clients-3.0.8.2/examples/ragraph'
making in ./ragrep
make[2]: Entering directory '/build/argus-clients/src/argus-clients-3.0.8.2/examples/ragrep'
gcc -O -march=armv7-a -mfloat-abi=hard -mfpu=vfpv3-d16 -O2 -pipe -fstack-protector --param=ssp-buffer-size=4 -I. -I../../include -I../../common -D_FORTIFY_SOURCE=2 -DHAVE_CONFIG_H -c ./ragrep.c
make[2]: *** No rule to make target '../../lib/argus_common.a', needed by '../../bin/ragrep'.  Stop.
make[2]: Leaving directory '/build/argus-clients/src/argus-clients-3.0.8.2/examples/ragrep'
making in ./rahisto
make[2]: Entering directory '/build/argus-clients/src/argus-clients-3.0.8.2/examples/rahisto'
gcc -O -march=armv7-a -mfloat-abi=hard -mfpu=vfpv3-d16 -O2 -pipe -fstack-protector --param=ssp-buffer-size=4 -I. -I../../include -I../../common -D_FORTIFY_SOURCE=2 -DHAVE_CONFIG_H -c ./rahisto.c
make[2]: *** No rule to make target '../../lib/argus_common.a', needed by '../../bin/rahisto'.  Stop.
make[2]: Leaving directory '/build/argus-clients/src/argus-clients-3.0.8.2/examples/rahisto'
making in ./rahosts
make[2]: Entering directory '/build/argus-clients/src/argus-clients-3.0.8.2/examples/rahosts'
sed 's+@PERLBIN@+/usr/bin/perl+' rahosts.pl > ../../bin/rahosts
chmod +x ../../bin/rahosts
sed 's+@PERLBIN@+/usr/bin/perl+' raips.pl > ../../bin/raips
chmod +x ../../bin/raips
make[2]: Leaving directory '/build/argus-clients/src/argus-clients-3.0.8.2/examples/rahosts'
making in ./ralabel
make[2]: Entering directory '/build/argus-clients/src/argus-clients-3.0.8.2/examples/ralabel'
gcc -O -march=armv7-a -mfloat-abi=hard -mfpu=vfpv3-d16 -O2 -pipe -fstack-protector --param=ssp-buffer-size=4 -I. -I../../include -I../../common -D_FORTIFY_SOURCE=2 -DHAVE_CONFIG_H -c ./ralabel.c
make[2]: *** No rule to make target '../../lib/argus_common.a', needed by '../../bin/ralabel'.  Stop.
make[2]: Leaving directory '/build/argus-clients/src/argus-clients-3.0.8.2/examples/ralabel'
making in ./rapath
make[2]: Entering directory '/build/argus-clients/src/argus-clients-3.0.8.2/examples/rapath'
gcc -O -march=armv7-a -mfloat-abi=hard -mfpu=vfpv3-d16 -O2 -pipe -fstack-protector --param=ssp-buffer-size=4 -I. -I../../include -I../../common -D_FORTIFY_SOURCE=2 -DHAVE_CONFIG_H -c ./rapath.c
make[2]: *** No rule to make target '../../lib/argus_common.a', needed by '../../bin/rapath'.  Stop.
make[2]: Leaving directory '/build/argus-clients/src/argus-clients-3.0.8.2/examples/rapath'
making in ./rapolicy
make[2]: Entering directory '/build/argus-clients/src/argus-clients-3.0.8.2/examples/rapolicy'
gcc -O -march=armv7-a -mfloat-abi=hard -mfpu=vfpv3-d16 -O2 -pipe -fstack-protector --param=ssp-buffer-size=4 -I. -I../../include -I../../common -D_FORTIFY_SOURCE=2 -DHAVE_CONFIG_H -c ./rapolicy.c
make[2]: *** No rule to make target '../../lib/argus_common.a', needed by '../../bin/rapolicy'.  Stop.
make[2]: Leaving directory '/build/argus-clients/src/argus-clients-3.0.8.2/examples/rapolicy'
making in ./raports
make[2]: Entering directory '/build/argus-clients/src/argus-clients-3.0.8.2/examples/raports'
sed 's+@PERLBIN@+/usr/bin/perl+' raports.pl > ../../bin/raports
chmod +x ../../bin/raports
make[2]: Leaving directory '/build/argus-clients/src/argus-clients-3.0.8.2/examples/raports'
making in ./rarpwatch
make[2]: Entering directory '/build/argus-clients/src/argus-clients-3.0.8.2/examples/rarpwatch'
gcc -O -march=armv7-a -mfloat-abi=hard -mfpu=vfpv3-d16 -O2 -pipe -fstack-protector --param=ssp-buffer-size=4 -I. -I../../include -I../../common -D_FORTIFY_SOURCE=2 -DHAVE_CONFIG_H -c ./rarpwatch.c
make[2]: *** No rule to make target '../../lib/argus_common.a', needed by '../../bin/rarpwatch'.  Stop.
make[2]: Leaving directory '/build/argus-clients/src/argus-clients-3.0.8.2/examples/rarpwatch'
making in ./raservices
make[2]: Entering directory '/build/argus-clients/src/argus-clients-3.0.8.2/examples/raservices'
gcc -O -march=armv7-a -mfloat-abi=hard -mfpu=vfpv3-d16 -O2 -pipe -fstack-protector --param=ssp-buffer-size=4 -I. -I../../include -I../../common -D_FORTIFY_SOURCE=2 -DHAVE_CONFIG_H -c ./raservices.c
make[2]: *** No rule to make target '../../lib/argus_common.a', needed by '../../bin/raservices'.  Stop.
make[2]: Leaving directory '/build/argus-clients/src/argus-clients-3.0.8.2/examples/raservices'
making in ./rastream
make[2]: Entering directory '/build/argus-clients/src/argus-clients-3.0.8.2/examples/rastream'
gcc -O -march=armv7-a -mfloat-abi=hard -mfpu=vfpv3-d16 -O2 -pipe -fstack-protector --param=ssp-buffer-size=4 -I. -I../../include -I../../common -D_FORTIFY_SOURCE=2 -DHAVE_CONFIG_H -c ./rastream.c
make[2]: *** No rule to make target '../../lib/argus_common.a', needed by '../../bin/rastream'.  Stop.
make[2]: Leaving directory '/build/argus-clients/src/argus-clients-3.0.8.2/examples/rastream'
making in ./rastrip
make[2]: Entering directory '/build/argus-clients/src/argus-clients-3.0.8.2/examples/rastrip'
gcc -O -march=armv7-a -mfloat-abi=hard -mfpu=vfpv3-d16 -O2 -pipe -fstack-protector --param=ssp-buffer-size=4 -I. -I../../include -I../../common -D_FORTIFY_SOURCE=2 -DHAVE_CONFIG_H -c ./rastrip.c
make[2]: *** No rule to make target '../../lib/argus_common.a', needed by '../../bin/rastrip'.  Stop.
make[2]: Leaving directory '/build/argus-clients/src/argus-clients-3.0.8.2/examples/rastrip'
making in ./ratop
make[2]: Entering directory '/build/argus-clients/src/argus-clients-3.0.8.2/examples/ratop'
gcc -O -march=armv7-a -mfloat-abi=hard -mfpu=vfpv3-d16 -O2 -pipe -fstack-protector --param=ssp-buffer-size=4 -I. -I../../include -I../../common -D_FORTIFY_SOURCE=2  -DHAVE_CONFIG_H -c ./racurses.c
gcc -O -march=armv7-a -mfloat-abi=hard -mfpu=vfpv3-d16 -O2 -pipe -fstack-protector --param=ssp-buffer-size=4 -I. -I../../include -I../../common -D_FORTIFY_SOURCE=2  -DHAVE_CONFIG_H -c ./raclient.c
make[2]: *** No rule to make target '../../lib/argus_common.a', needed by '../../bin/ratop'.  Stop.
make[2]: Leaving directory '/build/argus-clients/src/argus-clients-3.0.8.2/examples/ratop'
making in ./ratimerange
make[2]: Entering directory '/build/argus-clients/src/argus-clients-3.0.8.2/examples/ratimerange'
gcc -O -march=armv7-a -mfloat-abi=hard -mfpu=vfpv3-d16 -O2 -pipe -fstack-protector --param=ssp-buffer-size=4 -I. -I../../include -I../../common -D_FORTIFY_SOURCE=2 -DHAVE_CONFIG_H -c ./ratimerange.c
make[2]: *** No rule to make target '../../lib/argus_common.a', needed by '../../bin/ratimerange'.  Stop.
make[2]: Leaving directory '/build/argus-clients/src/argus-clients-3.0.8.2/examples/ratimerange'
making in ./ratemplate
make[2]: Entering directory '/build/argus-clients/src/argus-clients-3.0.8.2/examples/ratemplate'
gcc -O -march=armv7-a -mfloat-abi=hard -mfpu=vfpv3-d16 -O2 -pipe -fstack-protector --param=ssp-buffer-size=4 -I. -I../../include -I../../common -D_FORTIFY_SOURCE=2 -DHAVE_CONFIG_H -c ./ratemplate.c
make[2]: *** No rule to make target '../../lib/argus_common.a', needed by '../../bin/ratemplate'.  Stop.
make[2]: Leaving directory '/build/argus-clients/src/argus-clients-3.0.8.2/examples/ratemplate'
make[1]: *** [Makefile:60: all] Error 2
make[1]: Leaving directory '/build/argus-clients/src/argus-clients-3.0.8.2/examples'
make: *** [Makefile:63: all] Error 2
==> ERROR: A failure occurred in build().
    Aborting...
==> Removing installed dependencies...
checking dependencies...

Packages (2) geoip-1.6.12-1  geoip-database-20180403-1

Total Removed Size:  3.70 MiB

:: Do you want to remove these packages? [Y/n] 
:: Processing package changes...
removing geoip...
removing geoip-database...
:: Running post-transaction hooks...
(1/1) Arming ConditionNeedsUpdate...
==> ERROR: Build failed, check /chroot/armv7/build/build