==> Synchronizing chroot copy [/chroot/armv7/root] -> [build]...done
==> Making package: angr 9.0.8021-1 (Mon Jun 28 18:24:53 2021)
==> Retrieving sources...
  -> Found angr-9.0.8021.tar.gz
  -> Found angr.install
==> WARNING: Skipping verification of source file PGP signatures.
==> Validating source files with sha512sums...
    angr-9.0.8021.tar.gz ... Passed
    angr.install ... Passed
==> Making package: angr 9.0.8021-1 (Mon 28 Jun 2021 06:25:08 PM UTC)
==> Checking runtime dependencies...
==> Installing missing dependencies...
[?25lresolving dependencies...
looking for conflicting packages...

Packages (79) capstone-4.0.2-3  cython-0.29.23-1.1  git-2.32.0-1
              http-parser-2.9.4-1  libgit2-1:1.1.0-1  libnsl-1.3.0-2
              perl-error-0.17029-3  perl-mailtools-2.21-5  perl-timedate-2.33-3
              protobuf-3.17.3-1  python-3.9.5-3  python-appdirs-1.4.4-3
              python-babel-2.9.1-1  python-bitstring-3.1.7-3
              python-cached-property-1.5.2-3  python-chardet-4.0.0-2
              python-decorator-5.0.9-1  python-docutils-0.17.1-1
              python-future-0.18.2-5  python-gitdb-1:4.0.7-1  python-idna-3.2-1
              python-imagesize-1.2.0-4  python-jinja-3.0.1-1
              python-markupsafe-2.0.1-1  python-mock-3.0.5-6
              python-more-itertools-8.7.0-1  python-ordered-set-4.0.2-3
              python-packaging-20.9-1  python-pbr-5.6.0-1
              python-pefile-2021.5.24-1  python-plumbum-1.7.0-3
              python-ply-3.11-7  python-pygments-2.9.0-1
              python-pyparsing-2.4.7-3  python-pytz-2021.1-1
              python-requests-2.25.1-1  python-setuptools-1:57.0.0-2
              python-six-1.16.0-1  python-smmap-1:4.0.0-1
              python-snowballstemmer-2.1.0-1  python-sphinx-4.0.2-1
              python-sphinx-alabaster-theme-0.7.12-6
              python-sphinxcontrib-applehelp-1.0.2-6
              python-sphinxcontrib-devhelp-1.0.2-6
              python-sphinxcontrib-htmlhelp-2.0.0-1
              python-sphinxcontrib-jsmath-1.0.1-9
              python-sphinxcontrib-qthelp-1.0.3-6
              python-sphinxcontrib-serializinghtml-1.1.5-1
              python-urllib3-1.26.5-1  python-utils-2.5.6-1  python-z3-4.8.11-1
              unicorn-1.0.3-1  z3-4.8.11-1  python-ailment-9.0.8021-1
              python-ana-0.06-1  python-archinfo-9.0.8021-1
              python-bintrees-2.2.0-1  python-cachetools-4.2.2-1
              python-capstone-4.0.2-3  python-cffi-1.14.5-1
              python-claripy-9.0.8021-1  python-cle-9.0.8021-1
              python-cooldict-1.04-3  python-cppheaderparser-2.7.4-2
              python-dpkt-git-20210102.r628-1  python-gitpython-3.1.18-1
              python-itanium_demangler-1.0-2  python-mulpyplexer-0.08-2
              python-networkx-2.5.1-2  python-progressbar-3.53.1-5
              python-protobuf-3.17.3-1  python-psutil-5.8.0-1
              python-pycparser-2.20-3  python-pyelftools-0.27-1
              python-pygit2-1.6.1-1  python-pyvex-9.0.8021-1
              python-rpyc-5.0.1-1  python-sortedcontainers-2.4.0-1
              python-unicorn-1.0.3-1

Total Download Size:    27.67 MiB
Total Installed Size:  304.26 MiB

:: Proceed with installation? [Y/n] 
:: Retrieving packages...
 python-ailment-9.0.8021-1-any downloading...
 cython-0.29.23-1.1-armv7h downloading...
 python-bintrees-2.2.0-1-armv7h downloading...
 capstone-4.0.2-3-armv7h downloading...
 python-capstone-4.0.2-3-armv7h downloading...
 python-claripy-9.0.8021-1-any downloading...
 python-cle-9.0.8021-1-any downloading...
 python-cooldict-1.04-3-any downloading...
 python-cppheaderparser-2.7.4-2-any downloading...
 python-pbr-5.6.0-1-any downloading...
 python-mock-3.0.5-6-any downloading...
 python-pytz-2021.1-1-any downloading...
 python-babel-2.9.1-1-any downloading...
 python-docutils-0.17.1-1-any downloading...
 python-imagesize-1.2.0-4-any downloading...
 python-markupsafe-2.0.1-1-armv7h downloading...
 python-jinja-3.0.1-1-any downloading...
 python-pygments-2.9.0-1-any downloading...
 python-urllib3-1.26.5-1-any downloading...
 python-chardet-4.0.0-2-any downloading...
 python-idna-3.2-1-any downloading...
 python-requests-2.25.1-1-any downloading...
 python-snowballstemmer-2.1.0-1-any downloading...
 python-sphinx-alabaster-theme-0.7.12-6-any downloading...
 python-sphinxcontrib-applehelp-1.0.2-6-any downloading...
 python-sphinxcontrib-devhelp-1.0.2-6-any downloading...
 python-sphinxcontrib-htmlhelp-2.0.0-1-any downloading...
 python-sphinxcontrib-jsmath-1.0.1-9-any downloading...
 python-sphinxcontrib-qthelp-1.0.3-6-any downloading...
 python-sphinxcontrib-serializinghtml-1.1.5-1-any downloading...
 python-sphinx-4.0.2-1-any downloading...
 python-dpkt-git-20210102.r628-1-any downloading...
 perl-error-0.17029-3-any downloading...
 perl-timedate-2.33-3-any downloading...
 perl-mailtools-2.21-5-any downloading...
 git-2.32.0-1-armv7h downloading...
 python-smmap-1:4.0.0-1-any downloading...
 python-gitdb-1:4.0.7-1-any downloading...
 python-gitpython-3.1.18-1-any downloading...
 python-itanium_demangler-1.0-2-any downloading...
 python-mulpyplexer-0.08-2-any downloading...
 python-decorator-5.0.9-1-any downloading...
 python-networkx-2.5.1-2-any downloading...
 python-utils-2.5.6-1-any downloading...
 python-progressbar-3.53.1-5-any downloading...
 protobuf-3.17.3-1-armv7h downloading...
 python-protobuf-3.17.3-1-armv7h downloading...
 python-psutil-5.8.0-1-armv7h downloading...
 http-parser-2.9.4-1-armv7h downloading...
 libgit2-1:1.1.0-1-armv7h downloading...
 python-cached-property-1.5.2-3-any downloading...
 python-pygit2-1.6.1-1-armv7h downloading...
 python-plumbum-1.7.0-3-any downloading...
 python-rpyc-5.0.1-1-any downloading...
 unicorn-1.0.3-1-armv7h downloading...
 python-unicorn-1.0.3-1-armv7h downloading...
checking keyring...
checking package integrity...
loading package files...
checking for file conflicts...
checking available disk space...
:: Processing package changes...
installing libnsl...
installing python...
Optional dependencies for python
    python-setuptools [pending]
    python-pip
    sqlite [installed]
    mpdecimal: for decimal
    xz: for lzma [installed]
    tk: for tkinter
installing python-ply...
installing python-pycparser...
installing python-future...
Optional dependencies for python-future
    python-setuptools: futurize and pasteurize scripts [pending]
installing python-archinfo...
installing python-cffi...
installing python-bitstring...
installing python-pyvex...
installing python-ailment...
installing python-ana...
installing cython...
installing python-bintrees...
installing python-cachetools...
installing capstone...
installing python-capstone...
installing z3...
installing python-z3...
installing python-claripy...
installing python-pefile...
installing python-pyelftools...
installing python-sortedcontainers...
installing python-cle...
installing python-cooldict...
installing python-cppheaderparser...
installing python-six...
installing python-appdirs...
installing python-more-itertools...
installing python-ordered-set...
installing python-pyparsing...
installing python-packaging...
installing python-setuptools...
installing python-pbr...
installing python-mock...
installing python-pytz...
installing python-babel...
installing python-docutils...
installing python-imagesize...
installing python-markupsafe...
installing python-jinja...
Optional dependencies for python-jinja
    python-babel: for i18n support [installed]
installing python-pygments...
installing python-urllib3...
Optional dependencies for python-urllib3
    python-pysocks: SOCKS support
    python-brotli: Brotli support
    python-pyopenssl: security support
    python-idna: security support [pending]
installing python-chardet...
installing python-idna...
installing python-requests...
Optional dependencies for python-requests
    python-pysocks: SOCKS proxy support
installing python-snowballstemmer...
Optional dependencies for python-snowballstemmer
    python-pystemmer: for improved performance
installing python-sphinx-alabaster-theme...
installing python-sphinxcontrib-applehelp...
installing python-sphinxcontrib-devhelp...
installing python-sphinxcontrib-htmlhelp...
installing python-sphinxcontrib-jsmath...
installing python-sphinxcontrib-qthelp...
installing python-sphinxcontrib-serializinghtml...
installing python-sphinx...
Optional dependencies for python-sphinx
    imagemagick: for ext.imgconverter
    texlive-latexextra: for generation of PDF documentation
installing python-dpkt-git...
installing perl-error...
installing perl-timedate...
installing perl-mailtools...
installing git...
Optional dependencies for git
    tk: gitk and git gui
    perl-libwww: git svn
    perl-term-readkey: git svn and interactive.singlekey setting
    perl-io-socket-ssl: git send-email TLS support
    perl-authen-sasl: git send-email TLS support
    perl-mediawiki-api: git mediawiki support
    perl-datetime-format-iso8601: git mediawiki support
    perl-lwp-protocol-https: git mediawiki https support
    perl-cgi: gitweb (web interface) support
    python: git svn & git p4 [installed]
    subversion: git svn
    org.freedesktop.secrets: keyring credential helper
    libsecret: libsecret credential helper [installed]
installing python-smmap...
installing python-gitdb...
installing python-gitpython...
installing python-itanium_demangler...
installing python-mulpyplexer...
installing python-decorator...
installing python-networkx...
Optional dependencies for python-networkx
    python-numpy: Provides sparse matrix representation of graphs and many
    numerical scientific tools.
    python-scipy: Provides flexible drawing of graphs.
    python-pyparsing: Required for pydot, GML file reading. [installed]
    python-yaml: Required for YAML format reading and writing.
installing python-utils...
installing python-progressbar...
installing protobuf...
installing python-protobuf...
installing python-psutil...
installing http-parser...
installing libgit2...
installing python-cached-property...
installing python-pygit2...
installing python-plumbum...
installing python-rpyc...
installing unicorn...
installing python-unicorn...
:: Running post-transaction hooks...
(1/1) Warn about old perl modules
[?25h==> Checking buildtime dependencies...
==> Installing missing dependencies...
[?25lresolving dependencies...
looking for conflicting packages...

Packages (17) python-cachecontrol-0.12.6-3  python-colorama-0.4.4-3
              python-contextlib2-0.6.0.post1-3  python-cryptography-3.4.7-1
              python-distlib-0.3.2-1  python-distro-1.5.0-3
              python-html5lib-1.1-6  python-msgpack-1.0.2-2
              python-pep517-0.10.0-2  python-progress-1.5-5
              python-pyopenssl-20.0.1-1  python-resolvelib-0.5.5-1
              python-retrying-1.3.3-9  python-toml-0.10.2-3
              python-webencodings-0.5.1-6  python-pip-20.3.4-1
              python-wheel-0.36.2-1

Total Download Size:   1.63 MiB
Total Installed Size:  8.45 MiB

:: Proceed with installation? [Y/n] 
:: Retrieving packages...
 python-msgpack-1.0.2-2-armv7h downloading...
 python-cachecontrol-0.12.6-3-any downloading...
 python-colorama-0.4.4-3-any downloading...
 python-contextlib2-0.6.0.post1-3-any downloading...
 python-distlib-0.3.2-1-any downloading...
 python-distro-1.5.0-3-any downloading...
 python-webencodings-0.5.1-6-any downloading...
 python-html5lib-1.1-6-any downloading...
 python-toml-0.10.2-3-any downloading...
 python-pep517-0.10.0-2-any downloading...
 python-progress-1.5-5-any downloading...
 python-retrying-1.3.3-9-any downloading...
 python-resolvelib-0.5.5-1-any downloading...
 python-cryptography-3.4.7-1-armv7h downloading...
 python-pyopenssl-20.0.1-1-any downloading...
 python-pip-20.3.4-1-any downloading...
 python-wheel-0.36.2-1-any downloading...
checking keyring...
checking package integrity...
loading package files...
checking for file conflicts...
checking available disk space...
:: Processing package changes...
installing python-msgpack...
installing python-cachecontrol...
Optional dependencies for python-cachecontrol
    python-lockfile: for the FileCache
installing python-colorama...
installing python-contextlib2...
installing python-distlib...
installing python-distro...
installing python-webencodings...
installing python-html5lib...
Optional dependencies for python-html5lib
    python-lxml: lxml treebuilder
    python-genshi: genshi treewalker
installing python-toml...
installing python-pep517...
installing python-progress...
installing python-retrying...
installing python-resolvelib...
installing python-cryptography...
installing python-pyopenssl...
installing python-pip...
installing python-wheel...
Optional dependencies for python-wheel
    python-xdg: for wheel.signatures
[?25h==> Retrieving sources...
  -> Found angr-9.0.8021.tar.gz
  -> Found angr.install
==> WARNING: Skipping all source file integrity checks.
==> Extracting sources...
  -> Extracting angr-9.0.8021.tar.gz with bsdtar
==> Starting build()...
  ERROR: Command errored out with exit status 1:
   command: /usr/bin/python -u -c 'import sys, setuptools, tokenize; sys.argv[0] = '"'"'/tmp/pip-wheel-o8fkn_ru/unicorn_10a6c597b4234e4fadac4c75c0af2a5a/setup.py'"'"'; __file__='"'"'/tmp/pip-wheel-o8fkn_ru/unicorn_10a6c597b4234e4fadac4c75c0af2a5a/setup.py'"'"';f=getattr(tokenize, '"'"'open'"'"', open)(__file__);code=f.read().replace('"'"'\r\n'"'"', '"'"'\n'"'"');f.close();exec(compile(code, __file__, '"'"'exec'"'"'))' bdist_wheel -d /tmp/pip-wheel-z10_dxan
       cwd: /tmp/pip-wheel-o8fkn_ru/unicorn_10a6c597b4234e4fadac4c75c0af2a5a/
  Complete output (828 lines):
  /usr/lib/python3.9/site-packages/setuptools/dist.py:484: UserWarning: Normalizing '1.0.2.rc4' to '1.0.2rc4'
    warnings.warn(tmpl.format(**locals()))
  running bdist_wheel
  running build
  Building C extensions
  cd qemu && \
  ./configure --cc="cc" --extra-cflags="-DUNICORN_HAS_X86 -DUNICORN_HAS_ARM -DUNICORN_HAS_ARMEB -DUNICORN_HAS_M68K -DUNICORN_HAS_ARM64 -DUNICORN_HAS_ARM64EB -DUNICORN_HAS_MIPS -DUNICORN_HAS_MIPSEL -DUNICORN_HAS_MIPS64 -DUNICORN_HAS_MIPS64EL -DUNICORN_HAS_SPARC -fPIC -fvisibility=hidden" --target-list="x86_64-softmmu, arm-softmmu, armeb-softmmu, m68k-softmmu, aarch64-softmmu, aarch64eb-softmmu, mips-softmmu, mipsel-softmmu, mips64-softmmu, mips64el-softmmu, sparc-softmmu,sparc64-softmmu,"
  Source path       /tmp/pip-wheel-o8fkn_ru/unicorn_10a6c597b4234e4fadac4c75c0af2a5a/src/qemu
  C compiler        cc
  Host C compiler   cc
  Objective-C compiler cc
  ARFLAGS           rv
  CFLAGS            -g -march=armv7-a -mfloat-abi=hard -mfpu=vfpv3-d16 -O2 -pipe -fstack-protector --param=ssp-buffer-size=4 -g
  QEMU_CFLAGS        -D_GNU_SOURCE -D_FILE_OFFSET_BITS=64 -D_LARGEFILE_SOURCE -Wstrict-prototypes -Wredundant-decls -Wall -Wundef -Wwrite-strings -Wmissing-prototypes -fno-strict-aliasing -fno-common -DUNICORN_HAS_X86 -DUNICORN_HAS_ARM -DUNICORN_HAS_ARMEB -DUNICORN_HAS_M68K -DUNICORN_HAS_ARM64 -DUNICORN_HAS_ARM64EB -DUNICORN_HAS_MIPS -DUNICORN_HAS_MIPSEL -DUNICORN_HAS_MIPS64 -DUNICORN_HAS_MIPS64EL -DUNICORN_HAS_SPARC -fPIC -fvisibility=hidden  -Wendif-labels -Wmissing-include-dirs -Wempty-body -Wnested-externs -Wformat-security -Wformat-y2k -Winit-self -Wignored-qualifiers -Wold-style-declaration -Wold-style-definition -Wtype-limits -fstack-protector-strong
  LDFLAGS           -Wl,--warn-common -g -Wl,-O1,--sort-common,--as-needed,-z,relro
  make              make
  host CPU          arm
  host big endian   no
  target list       x86_64-softmmu  arm-softmmu  armeb-softmmu  m68k-softmmu  aarch64-softmmu  aarch64eb-softmmu  mips-softmmu  mipsel-softmmu  mips64-softmmu  mips64el-softmmu  sparc-softmmu sparc64-softmmu
  tcg debug enabled no
  strip binaries    yes
  static build      no
  mingw32 support   no
  PIE               no
  make -C qemu -j4
  make[1]: Entering directory '/tmp/pip-wheel-o8fkn_ru/unicorn_10a6c597b4234e4fadac4c75c0af2a5a/src/qemu'
    GEN   x86_64-softmmu/config-devices.mak
    GEN   arm-softmmu/config-devices.mak
    GEN   armeb-softmmu/config-devices.mak
    GEN   m68k-softmmu/config-devices.mak
    GEN   aarch64-softmmu/config-devices.mak
    GEN   aarch64eb-softmmu/config-devices.mak
    GEN   mipsel-softmmu/config-devices.mak
    GEN   mips-softmmu/config-devices.mak
    GEN   mips64-softmmu/config-devices.mak
    GEN   mips64el-softmmu/config-devices.mak
    GEN   sparc-softmmu/config-devices.mak
    GEN   sparc64-softmmu/config-devices.mak
    GEN   config-host.h
    GEN   config-all-devices.mak
    CC    accel.o
    CC    vl.o
    CC    qemu-timer.o
    CC    ../uc.o
    CC    ../list.o
    CC    glib_compat.o
    CC    qemu-log.o
    CC    tcg-runtime.o
    CC    hw/core/qdev.o
    CC    hw/core/machine.o
    CC    qom/object.o
    CC    qom/container.o
    CC    qom/qom-qobject.o
    CC    qom/cpu.o
    CC    qapi-types.o
    CC    qapi-visit.o
    CC    qapi/qapi-visit-core.o
    CC    qapi/qapi-dealloc-visitor.o
    CC    qapi/qmp-input-visitor.o
    CC    qapi/qmp-output-visitor.o
    CC    qapi/string-input-visitor.o
    CC    qobject/qint.o
    CC    qobject/qstring.o
    CC    qobject/qdict.o
    CC    qobject/qlist.o
    CC    qobject/qfloat.o
    CC    qobject/qbool.o
    CC    qobject/qerror.o
    CC    util/cutils.o
    CC    util/qemu-timer-common.o
    CC    util/oslib-posix.o
    CC    util/qemu-thread-posix.o
    CC    util/module.o
    CC    util/bitmap.o
    CC    util/bitops.o
    CC    util/error.o
    CC    util/aes.o
    CC    util/crc32c.o
    CC    util/host-utils.o
    CC    util/getauxval.o
    GEN   x86_64-softmmu/config-target.h
    GEN   armeb-softmmu/config-target.h
    GEN   m68k-softmmu/config-target.h
    GEN   arm-softmmu/config-target.h
    CC    x86_64-softmmu/exec.o
    CC    armeb-softmmu/exec.o
    CC    m68k-softmmu/exec.o
    CC    arm-softmmu/exec.o
    CC    armeb-softmmu/translate-all.o
    CC    m68k-softmmu/translate-all.o
    CC    x86_64-softmmu/translate-all.o
    CC    arm-softmmu/translate-all.o
    CC    armeb-softmmu/cpu-exec.o
    CC    m68k-softmmu/cpu-exec.o
    CC    x86_64-softmmu/cpu-exec.o
    CC    m68k-softmmu/tcg/tcg.o
    CC    armeb-softmmu/tcg/tcg.o
    CC    x86_64-softmmu/tcg/tcg.o
    CC    arm-softmmu/cpu-exec.o
    CC    arm-softmmu/tcg/tcg.o
    CC    m68k-softmmu/tcg/optimize.o
    CC    armeb-softmmu/tcg/optimize.o
    CC    x86_64-softmmu/tcg/optimize.o
    CC    armeb-softmmu/fpu/softfloat.o
    CC    x86_64-softmmu/fpu/softfloat.o
  /tmp/pip-wheel-o8fkn_ru/unicorn_10a6c597b4234e4fadac4c75c0af2a5a/src/qemu/fpu/softfloat.c: In function ‘roundAndPackFloat32_armeb’:
  /tmp/pip-wheel-o8fkn_ru/unicorn_10a6c597b4234e4fadac4c75c0af2a5a/src/qemu/fpu/softfloat.c:398:41: warning: ‘roundIncrement’ may be used uninitialized in this function [-Wmaybe-uninitialized]
    398 |                   && ( (int32_t) ( zSig + roundIncrement ) < 0 ) )
        |                                  ~~~~~~~^~~~~~~~~~~~~~~~~~
  /tmp/pip-wheel-o8fkn_ru/unicorn_10a6c597b4234e4fadac4c75c0af2a5a/src/qemu/fpu/softfloat.c: In function ‘roundAndPackFloat64_armeb’:
  /tmp/pip-wheel-o8fkn_ru/unicorn_10a6c597b4234e4fadac4c75c0af2a5a/src/qemu/fpu/softfloat.c:583:41: warning: ‘roundIncrement’ may be used uninitialized in this function [-Wmaybe-uninitialized]
    583 |                   && ( (int64_t) ( zSig + roundIncrement ) < 0 ) )
        |                                  ~~~~~~~^~~~~~~~~~~~~~~~~~
  /tmp/pip-wheel-o8fkn_ru/unicorn_10a6c597b4234e4fadac4c75c0af2a5a/src/qemu/fpu/softfloat.c: In function ‘roundAndPackFloatx80_armeb’:
  /tmp/pip-wheel-o8fkn_ru/unicorn_10a6c597b4234e4fadac4c75c0af2a5a/src/qemu/fpu/softfloat.c:831:19: warning: ‘increment’ may be used uninitialized in this function [-Wmaybe-uninitialized]
    829 |              || (    ( zExp == 0x7FFE )
        |                 ~~~~~~~~~~~~~~~~~~~~~~~
    830 |                   && ( zSig0 == LIT64( 0xFFFFFFFFFFFFFFFF ) )
        |                   ~~~~~~~~~~~~~~~~~~~~~~~~~~~~~~~~~~~~~~~~~~~
    831 |                   && increment
        |                   ^~~~~~~~~~~~
    832 |                 )
        |                 ~
  /tmp/pip-wheel-o8fkn_ru/unicorn_10a6c597b4234e4fadac4c75c0af2a5a/src/qemu/fpu/softfloat.c: In function ‘roundAndPackFloat32_x86_64’:
  /tmp/pip-wheel-o8fkn_ru/unicorn_10a6c597b4234e4fadac4c75c0af2a5a/src/qemu/fpu/softfloat.c:398:41: warning: ‘roundIncrement’ may be used uninitialized in this function [-Wmaybe-uninitialized]
    398 |                   && ( (int32_t) ( zSig + roundIncrement ) < 0 ) )
        |                                  ~~~~~~~^~~~~~~~~~~~~~~~~~
    CC    m68k-softmmu/fpu/softfloat.o
  /tmp/pip-wheel-o8fkn_ru/unicorn_10a6c597b4234e4fadac4c75c0af2a5a/src/qemu/fpu/softfloat.c: In function ‘roundAndPackFloat64_x86_64’:
  /tmp/pip-wheel-o8fkn_ru/unicorn_10a6c597b4234e4fadac4c75c0af2a5a/src/qemu/fpu/softfloat.c:583:41: warning: ‘roundIncrement’ may be used uninitialized in this function [-Wmaybe-uninitialized]
    583 |                   && ( (int64_t) ( zSig + roundIncrement ) < 0 ) )
        |                                  ~~~~~~~^~~~~~~~~~~~~~~~~~
  /tmp/pip-wheel-o8fkn_ru/unicorn_10a6c597b4234e4fadac4c75c0af2a5a/src/qemu/fpu/softfloat.c: In function ‘roundAndPackFloatx80_x86_64’:
  /tmp/pip-wheel-o8fkn_ru/unicorn_10a6c597b4234e4fadac4c75c0af2a5a/src/qemu/fpu/softfloat.c:831:19: warning: ‘increment’ may be used uninitialized in this function [-Wmaybe-uninitialized]
    829 |              || (    ( zExp == 0x7FFE )
        |                 ~~~~~~~~~~~~~~~~~~~~~~~
    830 |                   && ( zSig0 == LIT64( 0xFFFFFFFFFFFFFFFF ) )
        |                   ~~~~~~~~~~~~~~~~~~~~~~~~~~~~~~~~~~~~~~~~~~~
    831 |                   && increment
        |                   ^~~~~~~~~~~~
    832 |                 )
        |                 ~
  /tmp/pip-wheel-o8fkn_ru/unicorn_10a6c597b4234e4fadac4c75c0af2a5a/src/qemu/fpu/softfloat.c: In function ‘roundAndPackFloat128_armeb’:
  /tmp/pip-wheel-o8fkn_ru/unicorn_10a6c597b4234e4fadac4c75c0af2a5a/src/qemu/fpu/softfloat.c:1098:19: warning: ‘increment’ may be used uninitialized in this function [-Wmaybe-uninitialized]
   1091 |              || (    ( zExp == 0x7FFD )
        |                 ~~~~~~~~~~~~~~~~~~~~~~~
   1092 |                   && eq128(
        |                   ~~~~~~~~~
   1093 |                          LIT64( 0x0001FFFFFFFFFFFF ),
        |                          ~~~~~~~~~~~~~~~~~~~~~~~~~~~~
   1094 |                          LIT64( 0xFFFFFFFFFFFFFFFF ),
        |                          ~~~~~~~~~~~~~~~~~~~~~~~~~~~~
   1095 |                          zSig0,
        |                          ~~~~~~
   1096 |                          zSig1
        |                          ~~~~~
   1097 |                      )
        |                      ~
   1098 |                   && increment
        |                   ^~~~~~~~~~~~
   1099 |                 )
        |                 ~
  /tmp/pip-wheel-o8fkn_ru/unicorn_10a6c597b4234e4fadac4c75c0af2a5a/src/qemu/fpu/softfloat.c: In function ‘roundAndPackFloat128_x86_64’:
  /tmp/pip-wheel-o8fkn_ru/unicorn_10a6c597b4234e4fadac4c75c0af2a5a/src/qemu/fpu/softfloat.c:1098:19: warning: ‘increment’ may be used uninitialized in this function [-Wmaybe-uninitialized]
   1091 |              || (    ( zExp == 0x7FFD )
        |                 ~~~~~~~~~~~~~~~~~~~~~~~
   1092 |                   && eq128(
        |                   ~~~~~~~~~
   1093 |                          LIT64( 0x0001FFFFFFFFFFFF ),
        |                          ~~~~~~~~~~~~~~~~~~~~~~~~~~~~
   1094 |                          LIT64( 0xFFFFFFFFFFFFFFFF ),
        |                          ~~~~~~~~~~~~~~~~~~~~~~~~~~~~
   1095 |                          zSig0,
        |                          ~~~~~~
   1096 |                          zSig1
        |                          ~~~~~
   1097 |                      )
        |                      ~
   1098 |                   && increment
        |                   ^~~~~~~~~~~~
   1099 |                 )
        |                 ~
  /tmp/pip-wheel-o8fkn_ru/unicorn_10a6c597b4234e4fadac4c75c0af2a5a/src/qemu/fpu/softfloat.c: In function ‘roundAndPackFloat32_m68k’:
  /tmp/pip-wheel-o8fkn_ru/unicorn_10a6c597b4234e4fadac4c75c0af2a5a/src/qemu/fpu/softfloat.c:398:41: warning: ‘roundIncrement’ may be used uninitialized in this function [-Wmaybe-uninitialized]
    398 |                   && ( (int32_t) ( zSig + roundIncrement ) < 0 ) )
        |                                  ~~~~~~~^~~~~~~~~~~~~~~~~~
  /tmp/pip-wheel-o8fkn_ru/unicorn_10a6c597b4234e4fadac4c75c0af2a5a/src/qemu/fpu/softfloat.c: In function ‘roundAndPackFloat64_m68k’:
  /tmp/pip-wheel-o8fkn_ru/unicorn_10a6c597b4234e4fadac4c75c0af2a5a/src/qemu/fpu/softfloat.c:583:41: warning: ‘roundIncrement’ may be used uninitialized in this function [-Wmaybe-uninitialized]
    583 |                   && ( (int64_t) ( zSig + roundIncrement ) < 0 ) )
        |                                  ~~~~~~~^~~~~~~~~~~~~~~~~~
  /tmp/pip-wheel-o8fkn_ru/unicorn_10a6c597b4234e4fadac4c75c0af2a5a/src/qemu/fpu/softfloat.c: In function ‘roundAndPackFloatx80_m68k’:
  /tmp/pip-wheel-o8fkn_ru/unicorn_10a6c597b4234e4fadac4c75c0af2a5a/src/qemu/fpu/softfloat.c:831:19: warning: ‘increment’ may be used uninitialized in this function [-Wmaybe-uninitialized]
    829 |              || (    ( zExp == 0x7FFE )
        |                 ~~~~~~~~~~~~~~~~~~~~~~~
    830 |                   && ( zSig0 == LIT64( 0xFFFFFFFFFFFFFFFF ) )
        |                   ~~~~~~~~~~~~~~~~~~~~~~~~~~~~~~~~~~~~~~~~~~~
    831 |                   && increment
        |                   ^~~~~~~~~~~~
    832 |                 )
        |                 ~
  /tmp/pip-wheel-o8fkn_ru/unicorn_10a6c597b4234e4fadac4c75c0af2a5a/src/qemu/fpu/softfloat.c: In function ‘roundAndPackFloat128_m68k’:
  /tmp/pip-wheel-o8fkn_ru/unicorn_10a6c597b4234e4fadac4c75c0af2a5a/src/qemu/fpu/softfloat.c:1098:19: warning: ‘increment’ may be used uninitialized in this function [-Wmaybe-uninitialized]
   1091 |              || (    ( zExp == 0x7FFD )
        |                 ~~~~~~~~~~~~~~~~~~~~~~~
   1092 |                   && eq128(
        |                   ~~~~~~~~~
   1093 |                          LIT64( 0x0001FFFFFFFFFFFF ),
        |                          ~~~~~~~~~~~~~~~~~~~~~~~~~~~~
   1094 |                          LIT64( 0xFFFFFFFFFFFFFFFF ),
        |                          ~~~~~~~~~~~~~~~~~~~~~~~~~~~~
   1095 |                          zSig0,
        |                          ~~~~~~
   1096 |                          zSig1
        |                          ~~~~~
   1097 |                      )
        |                      ~
   1098 |                   && increment
        |                   ^~~~~~~~~~~~
   1099 |                 )
        |                 ~
    CC    arm-softmmu/tcg/optimize.o
    CC    arm-softmmu/fpu/softfloat.o
    CC    armeb-softmmu/cpus.o
    CC    x86_64-softmmu/cpus.o
    CC    armeb-softmmu/ioport.o
    CC    x86_64-softmmu/ioport.o
  /tmp/pip-wheel-o8fkn_ru/unicorn_10a6c597b4234e4fadac4c75c0af2a5a/src/qemu/fpu/softfloat.c: In function ‘roundAndPackFloat32_arm’:
  /tmp/pip-wheel-o8fkn_ru/unicorn_10a6c597b4234e4fadac4c75c0af2a5a/src/qemu/fpu/softfloat.c:398:41: warning: ‘roundIncrement’ may be used uninitialized in this function [-Wmaybe-uninitialized]
    398 |                   && ( (int32_t) ( zSig + roundIncrement ) < 0 ) )
        |                                  ~~~~~~~^~~~~~~~~~~~~~~~~~
    CC    armeb-softmmu/memory.o
  /tmp/pip-wheel-o8fkn_ru/unicorn_10a6c597b4234e4fadac4c75c0af2a5a/src/qemu/fpu/softfloat.c: In function ‘roundAndPackFloat64_arm’:
  /tmp/pip-wheel-o8fkn_ru/unicorn_10a6c597b4234e4fadac4c75c0af2a5a/src/qemu/fpu/softfloat.c:583:41: warning: ‘roundIncrement’ may be used uninitialized in this function [-Wmaybe-uninitialized]
    583 |                   && ( (int64_t) ( zSig + roundIncrement ) < 0 ) )
        |                                  ~~~~~~~^~~~~~~~~~~~~~~~~~
    CC    x86_64-softmmu/memory.o
  /tmp/pip-wheel-o8fkn_ru/unicorn_10a6c597b4234e4fadac4c75c0af2a5a/src/qemu/fpu/softfloat.c: In function ‘roundAndPackFloatx80_arm’:
  /tmp/pip-wheel-o8fkn_ru/unicorn_10a6c597b4234e4fadac4c75c0af2a5a/src/qemu/fpu/softfloat.c:831:19: warning: ‘increment’ may be used uninitialized in this function [-Wmaybe-uninitialized]
    829 |              || (    ( zExp == 0x7FFE )
        |                 ~~~~~~~~~~~~~~~~~~~~~~~
    830 |                   && ( zSig0 == LIT64( 0xFFFFFFFFFFFFFFFF ) )
        |                   ~~~~~~~~~~~~~~~~~~~~~~~~~~~~~~~~~~~~~~~~~~~
    831 |                   && increment
        |                   ^~~~~~~~~~~~
    832 |                 )
        |                 ~
  /tmp/pip-wheel-o8fkn_ru/unicorn_10a6c597b4234e4fadac4c75c0af2a5a/src/qemu/fpu/softfloat.c: In function ‘roundAndPackFloat128_arm’:
  /tmp/pip-wheel-o8fkn_ru/unicorn_10a6c597b4234e4fadac4c75c0af2a5a/src/qemu/fpu/softfloat.c:1098:19: warning: ‘increment’ may be used uninitialized in this function [-Wmaybe-uninitialized]
   1091 |              || (    ( zExp == 0x7FFD )
        |                 ~~~~~~~~~~~~~~~~~~~~~~~
   1092 |                   && eq128(
        |                   ~~~~~~~~~
   1093 |                          LIT64( 0x0001FFFFFFFFFFFF ),
        |                          ~~~~~~~~~~~~~~~~~~~~~~~~~~~~
   1094 |                          LIT64( 0xFFFFFFFFFFFFFFFF ),
        |                          ~~~~~~~~~~~~~~~~~~~~~~~~~~~~
   1095 |                          zSig0,
        |                          ~~~~~~
   1096 |                          zSig1
        |                          ~~~~~
   1097 |                      )
        |                      ~
   1098 |                   && increment
        |                   ^~~~~~~~~~~~
   1099 |                 )
        |                 ~
    CC    m68k-softmmu/cpus.o
    CC    m68k-softmmu/ioport.o
    CC    m68k-softmmu/memory.o
    CC    armeb-softmmu/cputlb.o
    CC    x86_64-softmmu/cputlb.o
    CC    m68k-softmmu/cputlb.o
    CC    armeb-softmmu/memory_mapping.o
    CC    armeb-softmmu/hw/arm/tosa.o
    CC    x86_64-softmmu/memory_mapping.o
    CC    armeb-softmmu/hw/arm/virt.o
    CC    x86_64-softmmu/hw/intc/apic.o
    CC    armeb-softmmu/target-arm/translate.o
    CC    x86_64-softmmu/hw/intc/apic_common.o
    CC    m68k-softmmu/memory_mapping.o
    CC    x86_64-softmmu/hw/i386/pc.o
    CC    m68k-softmmu/hw/m68k/dummy_m68k.o
    CC    x86_64-softmmu/hw/i386/pc_piix.o
    CC    m68k-softmmu/target-m68k/translate.o
    CC    x86_64-softmmu/target-i386/translate.o
    CC    arm-softmmu/cpus.o
    CC    m68k-softmmu/target-m68k/op_helper.o
    CC    m68k-softmmu/target-m68k/helper.o
    CC    arm-softmmu/ioport.o
    CC    arm-softmmu/memory.o
    CC    m68k-softmmu/target-m68k/cpu.o
    CC    m68k-softmmu/target-m68k/unicorn.o
    CC    x86_64-softmmu/target-i386/helper.o
    CC    armeb-softmmu/target-arm/op_helper.o
    CC    x86_64-softmmu/target-i386/cpu.o
    CC    arm-softmmu/cputlb.o
    CC    x86_64-softmmu/target-i386/excp_helper.o
    CC    x86_64-softmmu/target-i386/fpu_helper.o
    CC    arm-softmmu/memory_mapping.o
    CC    arm-softmmu/hw/arm/tosa.o
    CC    arm-softmmu/hw/arm/virt.o
    CC    arm-softmmu/target-arm/translate.o
    CC    armeb-softmmu/target-arm/helper.o
    CC    arm-softmmu/target-arm/op_helper.o
    CC    armeb-softmmu/target-arm/cpu.o
    CC    armeb-softmmu/target-arm/neon_helper.o
    CC    armeb-softmmu/target-arm/iwmmxt_helper.o
    CC    armeb-softmmu/target-arm/psci.o
    CC    armeb-softmmu/target-arm/unicorn_arm.o
    CC    armeb-softmmu/target-arm/crypto_helper.o
    CC    arm-softmmu/target-arm/helper.o
    CC    arm-softmmu/target-arm/cpu.o
    CC    arm-softmmu/target-arm/neon_helper.o
    CC    arm-softmmu/target-arm/iwmmxt_helper.o
    CC    arm-softmmu/target-arm/psci.o
    CC    arm-softmmu/target-arm/unicorn_arm.o
    CC    arm-softmmu/target-arm/crypto_helper.o
    CC    x86_64-softmmu/target-i386/cc_helper.o
    GEN   aarch64-softmmu/config-target.h
    CC    aarch64-softmmu/exec.o
    CC    aarch64-softmmu/translate-all.o
    CC    aarch64-softmmu/cpu-exec.o
    CC    x86_64-softmmu/target-i386/int_helper.o
    CC    aarch64-softmmu/tcg/tcg.o
    CC    aarch64-softmmu/tcg/optimize.o
    CC    aarch64-softmmu/fpu/softfloat.o
  /tmp/pip-wheel-o8fkn_ru/unicorn_10a6c597b4234e4fadac4c75c0af2a5a/src/qemu/fpu/softfloat.c: In function ‘roundAndPackFloat32_aarch64’:
  /tmp/pip-wheel-o8fkn_ru/unicorn_10a6c597b4234e4fadac4c75c0af2a5a/src/qemu/fpu/softfloat.c:398:41: warning: ‘roundIncrement’ may be used uninitialized in this function [-Wmaybe-uninitialized]
    398 |                   && ( (int32_t) ( zSig + roundIncrement ) < 0 ) )
        |                                  ~~~~~~~^~~~~~~~~~~~~~~~~~
  /tmp/pip-wheel-o8fkn_ru/unicorn_10a6c597b4234e4fadac4c75c0af2a5a/src/qemu/fpu/softfloat.c: In function ‘roundAndPackFloat64_aarch64’:
  /tmp/pip-wheel-o8fkn_ru/unicorn_10a6c597b4234e4fadac4c75c0af2a5a/src/qemu/fpu/softfloat.c:583:41: warning: ‘roundIncrement’ may be used uninitialized in this function [-Wmaybe-uninitialized]
    583 |                   && ( (int64_t) ( zSig + roundIncrement ) < 0 ) )
        |                                  ~~~~~~~^~~~~~~~~~~~~~~~~~
  /tmp/pip-wheel-o8fkn_ru/unicorn_10a6c597b4234e4fadac4c75c0af2a5a/src/qemu/fpu/softfloat.c: In function ‘roundAndPackFloatx80_aarch64’:
  /tmp/pip-wheel-o8fkn_ru/unicorn_10a6c597b4234e4fadac4c75c0af2a5a/src/qemu/fpu/softfloat.c:831:19: warning: ‘increment’ may be used uninitialized in this function [-Wmaybe-uninitialized]
    829 |              || (    ( zExp == 0x7FFE )
        |                 ~~~~~~~~~~~~~~~~~~~~~~~
    830 |                   && ( zSig0 == LIT64( 0xFFFFFFFFFFFFFFFF ) )
        |                   ~~~~~~~~~~~~~~~~~~~~~~~~~~~~~~~~~~~~~~~~~~~
    831 |                   && increment
        |                   ^~~~~~~~~~~~
    832 |                 )
        |                 ~
  /tmp/pip-wheel-o8fkn_ru/unicorn_10a6c597b4234e4fadac4c75c0af2a5a/src/qemu/fpu/softfloat.c: In function ‘roundAndPackFloat128_aarch64’:
  /tmp/pip-wheel-o8fkn_ru/unicorn_10a6c597b4234e4fadac4c75c0af2a5a/src/qemu/fpu/softfloat.c:1098:19: warning: ‘increment’ may be used uninitialized in this function [-Wmaybe-uninitialized]
   1091 |              || (    ( zExp == 0x7FFD )
        |                 ~~~~~~~~~~~~~~~~~~~~~~~
   1092 |                   && eq128(
        |                   ~~~~~~~~~
   1093 |                          LIT64( 0x0001FFFFFFFFFFFF ),
        |                          ~~~~~~~~~~~~~~~~~~~~~~~~~~~~
   1094 |                          LIT64( 0xFFFFFFFFFFFFFFFF ),
        |                          ~~~~~~~~~~~~~~~~~~~~~~~~~~~~
   1095 |                          zSig0,
        |                          ~~~~~~
   1096 |                          zSig1
        |                          ~~~~~
   1097 |                      )
        |                      ~
   1098 |                   && increment
        |                   ^~~~~~~~~~~~
   1099 |                 )
        |                 ~
    CC    x86_64-softmmu/target-i386/svm_helper.o
    GEN   aarch64eb-softmmu/config-target.h
    CC    aarch64eb-softmmu/exec.o
    CC    aarch64eb-softmmu/translate-all.o
    CC    aarch64eb-softmmu/cpu-exec.o
    CC    aarch64eb-softmmu/tcg/tcg.o
    CC    aarch64-softmmu/cpus.o
    CC    aarch64-softmmu/ioport.o
    CC    aarch64-softmmu/memory.o
    CC    aarch64-softmmu/cputlb.o
    CC    aarch64eb-softmmu/tcg/optimize.o
    CC    aarch64eb-softmmu/fpu/softfloat.o
    CC    aarch64-softmmu/memory_mapping.o
  /tmp/pip-wheel-o8fkn_ru/unicorn_10a6c597b4234e4fadac4c75c0af2a5a/src/qemu/fpu/softfloat.c: In function ‘roundAndPackFloat32_aarch64eb’:
  /tmp/pip-wheel-o8fkn_ru/unicorn_10a6c597b4234e4fadac4c75c0af2a5a/src/qemu/fpu/softfloat.c:398:41: warning: ‘roundIncrement’ may be used uninitialized in this function [-Wmaybe-uninitialized]
    398 |                   && ( (int32_t) ( zSig + roundIncrement ) < 0 ) )
        |                                  ~~~~~~~^~~~~~~~~~~~~~~~~~
  /tmp/pip-wheel-o8fkn_ru/unicorn_10a6c597b4234e4fadac4c75c0af2a5a/src/qemu/fpu/softfloat.c: In function ‘roundAndPackFloat64_aarch64eb’:
  /tmp/pip-wheel-o8fkn_ru/unicorn_10a6c597b4234e4fadac4c75c0af2a5a/src/qemu/fpu/softfloat.c:583:41: warning: ‘roundIncrement’ may be used uninitialized in this function [-Wmaybe-uninitialized]
    583 |                   && ( (int64_t) ( zSig + roundIncrement ) < 0 ) )
        |                                  ~~~~~~~^~~~~~~~~~~~~~~~~~
  /tmp/pip-wheel-o8fkn_ru/unicorn_10a6c597b4234e4fadac4c75c0af2a5a/src/qemu/fpu/softfloat.c: In function ‘roundAndPackFloatx80_aarch64eb’:
  /tmp/pip-wheel-o8fkn_ru/unicorn_10a6c597b4234e4fadac4c75c0af2a5a/src/qemu/fpu/softfloat.c:831:19: warning: ‘increment’ may be used uninitialized in this function [-Wmaybe-uninitialized]
    829 |              || (    ( zExp == 0x7FFE )
        |                 ~~~~~~~~~~~~~~~~~~~~~~~
    830 |                   && ( zSig0 == LIT64( 0xFFFFFFFFFFFFFFFF ) )
        |                   ~~~~~~~~~~~~~~~~~~~~~~~~~~~~~~~~~~~~~~~~~~~
    831 |                   && increment
        |                   ^~~~~~~~~~~~
    832 |                 )
        |                 ~
  /tmp/pip-wheel-o8fkn_ru/unicorn_10a6c597b4234e4fadac4c75c0af2a5a/src/qemu/fpu/softfloat.c: In function ‘roundAndPackFloat128_aarch64eb’:
  /tmp/pip-wheel-o8fkn_ru/unicorn_10a6c597b4234e4fadac4c75c0af2a5a/src/qemu/fpu/softfloat.c:1098:19: warning: ‘increment’ may be used uninitialized in this function [-Wmaybe-uninitialized]
   1091 |              || (    ( zExp == 0x7FFD )
        |                 ~~~~~~~~~~~~~~~~~~~~~~~
   1092 |                   && eq128(
        |                   ~~~~~~~~~
   1093 |                          LIT64( 0x0001FFFFFFFFFFFF ),
        |                          ~~~~~~~~~~~~~~~~~~~~~~~~~~~~
   1094 |                          LIT64( 0xFFFFFFFFFFFFFFFF ),
        |                          ~~~~~~~~~~~~~~~~~~~~~~~~~~~~
   1095 |                          zSig0,
        |                          ~~~~~~
   1096 |                          zSig1
        |                          ~~~~~
   1097 |                      )
        |                      ~
   1098 |                   && increment
        |                   ^~~~~~~~~~~~
   1099 |                 )
        |                 ~
    CC    aarch64-softmmu/hw/arm/tosa.o
    CC    aarch64-softmmu/hw/arm/virt.o
    CC    aarch64-softmmu/target-arm/translate.o
    CC    aarch64eb-softmmu/cpus.o
    CC    aarch64eb-softmmu/ioport.o
    CC    aarch64eb-softmmu/memory.o
    CC    aarch64eb-softmmu/cputlb.o
    CC    aarch64eb-softmmu/memory_mapping.o
    CC    aarch64eb-softmmu/hw/arm/tosa.o
    CC    aarch64eb-softmmu/hw/arm/virt.o
    CC    aarch64eb-softmmu/target-arm/translate.o
    CC    x86_64-softmmu/target-i386/smm_helper.o
    CC    x86_64-softmmu/target-i386/misc_helper.o
    CC    x86_64-softmmu/target-i386/mem_helper.o
    CC    x86_64-softmmu/target-i386/seg_helper.o
    CC    x86_64-softmmu/target-i386/arch_memory_mapping.o
    CC    aarch64eb-softmmu/target-arm/op_helper.o
    CC    aarch64eb-softmmu/target-arm/helper.o
    CC    x86_64-softmmu/target-i386/unicorn.o
    GEN   mips-softmmu/config-target.h
    CC    mips-softmmu/exec.o
    CC    mips-softmmu/translate-all.o
    CC    mips-softmmu/cpu-exec.o
    CC    mips-softmmu/tcg/tcg.o
    GEN   mipsel-softmmu/config-target.h
    CC    mipsel-softmmu/exec.o
    CC    mipsel-softmmu/translate-all.o
    CC    mips-softmmu/tcg/optimize.o
    CC    mipsel-softmmu/cpu-exec.o
    CC    mipsel-softmmu/tcg/tcg.o
    CC    mips-softmmu/fpu/softfloat.o
    CC    aarch64-softmmu/target-arm/op_helper.o
    CC    aarch64-softmmu/target-arm/helper.o
  /tmp/pip-wheel-o8fkn_ru/unicorn_10a6c597b4234e4fadac4c75c0af2a5a/src/qemu/fpu/softfloat.c: In function ‘roundAndPackFloat32_mips’:
  /tmp/pip-wheel-o8fkn_ru/unicorn_10a6c597b4234e4fadac4c75c0af2a5a/src/qemu/fpu/softfloat.c:398:41: warning: ‘roundIncrement’ may be used uninitialized in this function [-Wmaybe-uninitialized]
    398 |                   && ( (int32_t) ( zSig + roundIncrement ) < 0 ) )
        |                                  ~~~~~~~^~~~~~~~~~~~~~~~~~
    CC    mipsel-softmmu/tcg/optimize.o
  /tmp/pip-wheel-o8fkn_ru/unicorn_10a6c597b4234e4fadac4c75c0af2a5a/src/qemu/fpu/softfloat.c: In function ‘roundAndPackFloat64_mips’:
  /tmp/pip-wheel-o8fkn_ru/unicorn_10a6c597b4234e4fadac4c75c0af2a5a/src/qemu/fpu/softfloat.c:583:41: warning: ‘roundIncrement’ may be used uninitialized in this function [-Wmaybe-uninitialized]
    583 |                   && ( (int64_t) ( zSig + roundIncrement ) < 0 ) )
        |                                  ~~~~~~~^~~~~~~~~~~~~~~~~~
  /tmp/pip-wheel-o8fkn_ru/unicorn_10a6c597b4234e4fadac4c75c0af2a5a/src/qemu/fpu/softfloat.c: In function ‘roundAndPackFloatx80_mips’:
  /tmp/pip-wheel-o8fkn_ru/unicorn_10a6c597b4234e4fadac4c75c0af2a5a/src/qemu/fpu/softfloat.c:831:19: warning: ‘increment’ may be used uninitialized in this function [-Wmaybe-uninitialized]
    829 |              || (    ( zExp == 0x7FFE )
        |                 ~~~~~~~~~~~~~~~~~~~~~~~
    830 |                   && ( zSig0 == LIT64( 0xFFFFFFFFFFFFFFFF ) )
        |                   ~~~~~~~~~~~~~~~~~~~~~~~~~~~~~~~~~~~~~~~~~~~
    831 |                   && increment
        |                   ^~~~~~~~~~~~
    832 |                 )
        |                 ~
  /tmp/pip-wheel-o8fkn_ru/unicorn_10a6c597b4234e4fadac4c75c0af2a5a/src/qemu/fpu/softfloat.c: In function ‘roundAndPackFloat128_mips’:
  /tmp/pip-wheel-o8fkn_ru/unicorn_10a6c597b4234e4fadac4c75c0af2a5a/src/qemu/fpu/softfloat.c:1098:19: warning: ‘increment’ may be used uninitialized in this function [-Wmaybe-uninitialized]
   1091 |              || (    ( zExp == 0x7FFD )
        |                 ~~~~~~~~~~~~~~~~~~~~~~~
   1092 |                   && eq128(
        |                   ~~~~~~~~~
   1093 |                          LIT64( 0x0001FFFFFFFFFFFF ),
        |                          ~~~~~~~~~~~~~~~~~~~~~~~~~~~~
   1094 |                          LIT64( 0xFFFFFFFFFFFFFFFF ),
        |                          ~~~~~~~~~~~~~~~~~~~~~~~~~~~~
   1095 |                          zSig0,
        |                          ~~~~~~
   1096 |                          zSig1
        |                          ~~~~~
   1097 |                      )
        |                      ~
   1098 |                   && increment
        |                   ^~~~~~~~~~~~
   1099 |                 )
        |                 ~
    CC    mipsel-softmmu/fpu/softfloat.o
  /tmp/pip-wheel-o8fkn_ru/unicorn_10a6c597b4234e4fadac4c75c0af2a5a/src/qemu/fpu/softfloat.c: In function ‘roundAndPackFloat32_mipsel’:
  /tmp/pip-wheel-o8fkn_ru/unicorn_10a6c597b4234e4fadac4c75c0af2a5a/src/qemu/fpu/softfloat.c:398:41: warning: ‘roundIncrement’ may be used uninitialized in this function [-Wmaybe-uninitialized]
    398 |                   && ( (int32_t) ( zSig + roundIncrement ) < 0 ) )
        |                                  ~~~~~~~^~~~~~~~~~~~~~~~~~
  /tmp/pip-wheel-o8fkn_ru/unicorn_10a6c597b4234e4fadac4c75c0af2a5a/src/qemu/fpu/softfloat.c: In function ‘roundAndPackFloat64_mipsel’:
  /tmp/pip-wheel-o8fkn_ru/unicorn_10a6c597b4234e4fadac4c75c0af2a5a/src/qemu/fpu/softfloat.c:583:41: warning: ‘roundIncrement’ may be used uninitialized in this function [-Wmaybe-uninitialized]
    583 |                   && ( (int64_t) ( zSig + roundIncrement ) < 0 ) )
        |                                  ~~~~~~~^~~~~~~~~~~~~~~~~~
  /tmp/pip-wheel-o8fkn_ru/unicorn_10a6c597b4234e4fadac4c75c0af2a5a/src/qemu/fpu/softfloat.c: In function ‘roundAndPackFloatx80_mipsel’:
  /tmp/pip-wheel-o8fkn_ru/unicorn_10a6c597b4234e4fadac4c75c0af2a5a/src/qemu/fpu/softfloat.c:831:19: warning: ‘increment’ may be used uninitialized in this function [-Wmaybe-uninitialized]
    829 |              || (    ( zExp == 0x7FFE )
        |                 ~~~~~~~~~~~~~~~~~~~~~~~
    830 |                   && ( zSig0 == LIT64( 0xFFFFFFFFFFFFFFFF ) )
        |                   ~~~~~~~~~~~~~~~~~~~~~~~~~~~~~~~~~~~~~~~~~~~
    831 |                   && increment
        |                   ^~~~~~~~~~~~
    832 |                 )
        |                 ~
  /tmp/pip-wheel-o8fkn_ru/unicorn_10a6c597b4234e4fadac4c75c0af2a5a/src/qemu/fpu/softfloat.c: In function ‘roundAndPackFloat128_mipsel’:
  /tmp/pip-wheel-o8fkn_ru/unicorn_10a6c597b4234e4fadac4c75c0af2a5a/src/qemu/fpu/softfloat.c:1098:19: warning: ‘increment’ may be used uninitialized in this function [-Wmaybe-uninitialized]
   1091 |              || (    ( zExp == 0x7FFD )
        |                 ~~~~~~~~~~~~~~~~~~~~~~~
   1092 |                   && eq128(
        |                   ~~~~~~~~~
   1093 |                          LIT64( 0x0001FFFFFFFFFFFF ),
        |                          ~~~~~~~~~~~~~~~~~~~~~~~~~~~~
   1094 |                          LIT64( 0xFFFFFFFFFFFFFFFF ),
        |                          ~~~~~~~~~~~~~~~~~~~~~~~~~~~~
   1095 |                          zSig0,
        |                          ~~~~~~
   1096 |                          zSig1
        |                          ~~~~~
   1097 |                      )
        |                      ~
   1098 |                   && increment
        |                   ^~~~~~~~~~~~
   1099 |                 )
        |                 ~
    CC    aarch64-softmmu/target-arm/cpu.o
    CC    aarch64-softmmu/target-arm/neon_helper.o
    CC    aarch64-softmmu/target-arm/iwmmxt_helper.o
    CC    aarch64-softmmu/target-arm/psci.o
    CC    mipsel-softmmu/cpus.o
    CC    mipsel-softmmu/ioport.o
    CC    aarch64-softmmu/target-arm/cpu64.o
    CC    mipsel-softmmu/memory.o
    CC    aarch64-softmmu/target-arm/translate-a64.o
    CC    aarch64eb-softmmu/target-arm/cpu.o
    CC    mips-softmmu/cpus.o
    CC    mipsel-softmmu/cputlb.o
    CC    mips-softmmu/ioport.o
    CC    aarch64eb-softmmu/target-arm/neon_helper.o
    CC    mips-softmmu/memory.o
    CC    mipsel-softmmu/memory_mapping.o
    CC    aarch64eb-softmmu/target-arm/iwmmxt_helper.o
    CC    mipsel-softmmu/hw/mips/mips_r4k.o
    CC    mipsel-softmmu/hw/mips/addr.o
    CC    mips-softmmu/cputlb.o
    CC    mipsel-softmmu/hw/mips/cputimer.o
    CC    mipsel-softmmu/target-mips/translate.o
    CC    aarch64eb-softmmu/target-arm/psci.o
    CC    aarch64eb-softmmu/target-arm/cpu64.o
    CC    aarch64eb-softmmu/target-arm/translate-a64.o
    CC    mips-softmmu/memory_mapping.o
    CC    mips-softmmu/hw/mips/mips_r4k.o
    CC    mips-softmmu/hw/mips/addr.o
    CC    mips-softmmu/hw/mips/cputimer.o
    CC    mips-softmmu/target-mips/translate.o
    CC    aarch64-softmmu/target-arm/helper-a64.o
    CC    aarch64-softmmu/target-arm/unicorn_aarch64.o
    CC    aarch64-softmmu/target-arm/crypto_helper.o
    CC    mips-softmmu/target-mips/dsp_helper.o
    CC    aarch64eb-softmmu/target-arm/helper-a64.o
    CC    aarch64eb-softmmu/target-arm/unicorn_aarch64.o
    CC    aarch64eb-softmmu/target-arm/crypto_helper.o
    CC    mips-softmmu/target-mips/op_helper.o
    CC    mips-softmmu/target-mips/lmi_helper.o
    CC    mips-softmmu/target-mips/helper.o
    CC    mips-softmmu/target-mips/cpu.o
    CC    mips-softmmu/target-mips/msa_helper.o
    CC    mips-softmmu/target-mips/unicorn.o
    GEN   mips64-softmmu/config-target.h
    CC    mips64-softmmu/exec.o
    CC    mips64-softmmu/translate-all.o
    CC    mips64-softmmu/cpu-exec.o
    CC    mips64-softmmu/tcg/tcg.o
    CC    mipsel-softmmu/target-mips/dsp_helper.o
    CC    mips64-softmmu/tcg/optimize.o
    CC    mips64-softmmu/fpu/softfloat.o
    CC    mipsel-softmmu/target-mips/op_helper.o
  /tmp/pip-wheel-o8fkn_ru/unicorn_10a6c597b4234e4fadac4c75c0af2a5a/src/qemu/fpu/softfloat.c: In function ‘roundAndPackFloat32_mips64’:
  /tmp/pip-wheel-o8fkn_ru/unicorn_10a6c597b4234e4fadac4c75c0af2a5a/src/qemu/fpu/softfloat.c:398:41: warning: ‘roundIncrement’ may be used uninitialized in this function [-Wmaybe-uninitialized]
    398 |                   && ( (int32_t) ( zSig + roundIncrement ) < 0 ) )
        |                                  ~~~~~~~^~~~~~~~~~~~~~~~~~
  /tmp/pip-wheel-o8fkn_ru/unicorn_10a6c597b4234e4fadac4c75c0af2a5a/src/qemu/fpu/softfloat.c: In function ‘roundAndPackFloat64_mips64’:
  /tmp/pip-wheel-o8fkn_ru/unicorn_10a6c597b4234e4fadac4c75c0af2a5a/src/qemu/fpu/softfloat.c:583:41: warning: ‘roundIncrement’ may be used uninitialized in this function [-Wmaybe-uninitialized]
    583 |                   && ( (int64_t) ( zSig + roundIncrement ) < 0 ) )
        |                                  ~~~~~~~^~~~~~~~~~~~~~~~~~
  /tmp/pip-wheel-o8fkn_ru/unicorn_10a6c597b4234e4fadac4c75c0af2a5a/src/qemu/fpu/softfloat.c: In function ‘roundAndPackFloatx80_mips64’:
  /tmp/pip-wheel-o8fkn_ru/unicorn_10a6c597b4234e4fadac4c75c0af2a5a/src/qemu/fpu/softfloat.c:831:19: warning: ‘increment’ may be used uninitialized in this function [-Wmaybe-uninitialized]
    829 |              || (    ( zExp == 0x7FFE )
        |                 ~~~~~~~~~~~~~~~~~~~~~~~
    830 |                   && ( zSig0 == LIT64( 0xFFFFFFFFFFFFFFFF ) )
        |                   ~~~~~~~~~~~~~~~~~~~~~~~~~~~~~~~~~~~~~~~~~~~
    831 |                   && increment
        |                   ^~~~~~~~~~~~
    832 |                 )
        |                 ~
  /tmp/pip-wheel-o8fkn_ru/unicorn_10a6c597b4234e4fadac4c75c0af2a5a/src/qemu/fpu/softfloat.c: In function ‘roundAndPackFloat128_mips64’:
  /tmp/pip-wheel-o8fkn_ru/unicorn_10a6c597b4234e4fadac4c75c0af2a5a/src/qemu/fpu/softfloat.c:1098:19: warning: ‘increment’ may be used uninitialized in this function [-Wmaybe-uninitialized]
   1091 |              || (    ( zExp == 0x7FFD )
        |                 ~~~~~~~~~~~~~~~~~~~~~~~
   1092 |                   && eq128(
        |                   ~~~~~~~~~
   1093 |                          LIT64( 0x0001FFFFFFFFFFFF ),
        |                          ~~~~~~~~~~~~~~~~~~~~~~~~~~~~
   1094 |                          LIT64( 0xFFFFFFFFFFFFFFFF ),
        |                          ~~~~~~~~~~~~~~~~~~~~~~~~~~~~
   1095 |                          zSig0,
        |                          ~~~~~~
   1096 |                          zSig1
        |                          ~~~~~
   1097 |                      )
        |                      ~
   1098 |                   && increment
        |                   ^~~~~~~~~~~~
   1099 |                 )
        |                 ~
    CC    mips64-softmmu/cpus.o
    CC    mips64-softmmu/ioport.o
    CC    mips64-softmmu/memory.o
    CC    mipsel-softmmu/target-mips/lmi_helper.o
    CC    mips64-softmmu/cputlb.o
    GEN   mips64el-softmmu/config-target.h
    CC    mips64el-softmmu/exec.o
    CC    mips64el-softmmu/translate-all.o
    CC    mips64el-softmmu/cpu-exec.o
    CC    mips64el-softmmu/tcg/tcg.o
    CC    mips64-softmmu/memory_mapping.o
    CC    mips64-softmmu/hw/mips/mips_r4k.o
    CC    mips64-softmmu/hw/mips/addr.o
    CC    mips64-softmmu/hw/mips/cputimer.o
    CC    mips64-softmmu/target-mips/translate.o
    CC    mips64-softmmu/target-mips/dsp_helper.o
    CC    mipsel-softmmu/target-mips/helper.o
    CC    mips64el-softmmu/tcg/optimize.o
    CC    mips64el-softmmu/fpu/softfloat.o
  /tmp/pip-wheel-o8fkn_ru/unicorn_10a6c597b4234e4fadac4c75c0af2a5a/src/qemu/fpu/softfloat.c: In function ‘roundAndPackFloat32_mips64el’:
  /tmp/pip-wheel-o8fkn_ru/unicorn_10a6c597b4234e4fadac4c75c0af2a5a/src/qemu/fpu/softfloat.c:398:41: warning: ‘roundIncrement’ may be used uninitialized in this function [-Wmaybe-uninitialized]
    398 |                   && ( (int32_t) ( zSig + roundIncrement ) < 0 ) )
        |                                  ~~~~~~~^~~~~~~~~~~~~~~~~~
  /tmp/pip-wheel-o8fkn_ru/unicorn_10a6c597b4234e4fadac4c75c0af2a5a/src/qemu/fpu/softfloat.c: In function ‘roundAndPackFloat64_mips64el’:
  /tmp/pip-wheel-o8fkn_ru/unicorn_10a6c597b4234e4fadac4c75c0af2a5a/src/qemu/fpu/softfloat.c:583:41: warning: ‘roundIncrement’ may be used uninitialized in this function [-Wmaybe-uninitialized]
    583 |                   && ( (int64_t) ( zSig + roundIncrement ) < 0 ) )
        |                                  ~~~~~~~^~~~~~~~~~~~~~~~~~
  /tmp/pip-wheel-o8fkn_ru/unicorn_10a6c597b4234e4fadac4c75c0af2a5a/src/qemu/fpu/softfloat.c: In function ‘roundAndPackFloatx80_mips64el’:
  /tmp/pip-wheel-o8fkn_ru/unicorn_10a6c597b4234e4fadac4c75c0af2a5a/src/qemu/fpu/softfloat.c:831:19: warning: ‘increment’ may be used uninitialized in this function [-Wmaybe-uninitialized]
    829 |              || (    ( zExp == 0x7FFE )
        |                 ~~~~~~~~~~~~~~~~~~~~~~~
    830 |                   && ( zSig0 == LIT64( 0xFFFFFFFFFFFFFFFF ) )
        |                   ~~~~~~~~~~~~~~~~~~~~~~~~~~~~~~~~~~~~~~~~~~~
    831 |                   && increment
        |                   ^~~~~~~~~~~~
    832 |                 )
        |                 ~
    CC    mipsel-softmmu/target-mips/cpu.o
  /tmp/pip-wheel-o8fkn_ru/unicorn_10a6c597b4234e4fadac4c75c0af2a5a/src/qemu/fpu/softfloat.c: In function ‘roundAndPackFloat128_mips64el’:
  /tmp/pip-wheel-o8fkn_ru/unicorn_10a6c597b4234e4fadac4c75c0af2a5a/src/qemu/fpu/softfloat.c:1098:19: warning: ‘increment’ may be used uninitialized in this function [-Wmaybe-uninitialized]
   1091 |              || (    ( zExp == 0x7FFD )
        |                 ~~~~~~~~~~~~~~~~~~~~~~~
   1092 |                   && eq128(
        |                   ~~~~~~~~~
   1093 |                          LIT64( 0x0001FFFFFFFFFFFF ),
        |                          ~~~~~~~~~~~~~~~~~~~~~~~~~~~~
   1094 |                          LIT64( 0xFFFFFFFFFFFFFFFF ),
        |                          ~~~~~~~~~~~~~~~~~~~~~~~~~~~~
   1095 |                          zSig0,
        |                          ~~~~~~
   1096 |                          zSig1
        |                          ~~~~~
   1097 |                      )
        |                      ~
   1098 |                   && increment
        |                   ^~~~~~~~~~~~
   1099 |                 )
        |                 ~
    CC    mips64el-softmmu/cpus.o
    CC    mips64el-softmmu/ioport.o
    CC    mips64el-softmmu/memory.o
    CC    mips64el-softmmu/cputlb.o
    CC    mipsel-softmmu/target-mips/msa_helper.o
    CC    mips64el-softmmu/memory_mapping.o
    CC    mips64el-softmmu/hw/mips/mips_r4k.o
    CC    mips64el-softmmu/hw/mips/addr.o
    CC    mips64el-softmmu/hw/mips/cputimer.o
    CC    mips64el-softmmu/target-mips/translate.o
    CC    mips64-softmmu/target-mips/op_helper.o
    CC    mipsel-softmmu/target-mips/unicorn.o
    CC    mips64-softmmu/target-mips/lmi_helper.o
    CC    mips64-softmmu/target-mips/helper.o
    CC    mips64-softmmu/target-mips/cpu.o
    CC    mips64-softmmu/target-mips/msa_helper.o
    CC    mips64el-softmmu/target-mips/dsp_helper.o
    CC    mips64el-softmmu/target-mips/op_helper.o
    GEN   sparc-softmmu/config-target.h
    CC    sparc-softmmu/exec.o
    CC    sparc-softmmu/translate-all.o
    CC    sparc-softmmu/cpu-exec.o
    CC    sparc-softmmu/tcg/tcg.o
    CC    sparc-softmmu/tcg/optimize.o
    CC    sparc-softmmu/fpu/softfloat.o
    CC    sparc-softmmu/cpus.o
  /tmp/pip-wheel-o8fkn_ru/unicorn_10a6c597b4234e4fadac4c75c0af2a5a/src/qemu/fpu/softfloat.c: In function ‘roundAndPackFloat32_sparc’:
  /tmp/pip-wheel-o8fkn_ru/unicorn_10a6c597b4234e4fadac4c75c0af2a5a/src/qemu/fpu/softfloat.c:398:41: warning: ‘roundIncrement’ may be used uninitialized in this function [-Wmaybe-uninitialized]
    398 |                   && ( (int32_t) ( zSig + roundIncrement ) < 0 ) )
        |                                  ~~~~~~~^~~~~~~~~~~~~~~~~~
  /tmp/pip-wheel-o8fkn_ru/unicorn_10a6c597b4234e4fadac4c75c0af2a5a/src/qemu/fpu/softfloat.c: In function ‘roundAndPackFloat64_sparc’:
  /tmp/pip-wheel-o8fkn_ru/unicorn_10a6c597b4234e4fadac4c75c0af2a5a/src/qemu/fpu/softfloat.c:583:41: warning: ‘roundIncrement’ may be used uninitialized in this function [-Wmaybe-uninitialized]
    583 |                   && ( (int64_t) ( zSig + roundIncrement ) < 0 ) )
        |                                  ~~~~~~~^~~~~~~~~~~~~~~~~~
  /tmp/pip-wheel-o8fkn_ru/unicorn_10a6c597b4234e4fadac4c75c0af2a5a/src/qemu/fpu/softfloat.c: In function ‘roundAndPackFloatx80_sparc’:
  /tmp/pip-wheel-o8fkn_ru/unicorn_10a6c597b4234e4fadac4c75c0af2a5a/src/qemu/fpu/softfloat.c:831:19: warning: ‘increment’ may be used uninitialized in this function [-Wmaybe-uninitialized]
    829 |              || (    ( zExp == 0x7FFE )
        |                 ~~~~~~~~~~~~~~~~~~~~~~~
    830 |                   && ( zSig0 == LIT64( 0xFFFFFFFFFFFFFFFF ) )
        |                   ~~~~~~~~~~~~~~~~~~~~~~~~~~~~~~~~~~~~~~~~~~~
    831 |                   && increment
        |                   ^~~~~~~~~~~~
    832 |                 )
        |                 ~
    CC    sparc-softmmu/ioport.o
  /tmp/pip-wheel-o8fkn_ru/unicorn_10a6c597b4234e4fadac4c75c0af2a5a/src/qemu/fpu/softfloat.c: In function ‘roundAndPackFloat128_sparc’:
  /tmp/pip-wheel-o8fkn_ru/unicorn_10a6c597b4234e4fadac4c75c0af2a5a/src/qemu/fpu/softfloat.c:1098:19: warning: ‘increment’ may be used uninitialized in this function [-Wmaybe-uninitialized]
   1091 |              || (    ( zExp == 0x7FFD )
        |                 ~~~~~~~~~~~~~~~~~~~~~~~
   1092 |                   && eq128(
        |                   ~~~~~~~~~
   1093 |                          LIT64( 0x0001FFFFFFFFFFFF ),
        |                          ~~~~~~~~~~~~~~~~~~~~~~~~~~~~
   1094 |                          LIT64( 0xFFFFFFFFFFFFFFFF ),
        |                          ~~~~~~~~~~~~~~~~~~~~~~~~~~~~
   1095 |                          zSig0,
        |                          ~~~~~~
   1096 |                          zSig1
        |                          ~~~~~
   1097 |                      )
        |                      ~
   1098 |                   && increment
        |                   ^~~~~~~~~~~~
   1099 |                 )
        |                 ~
    CC    mips64-softmmu/target-mips/unicorn.o
    CC    sparc-softmmu/memory.o
    GEN   sparc64-softmmu/config-target.h
    CC    sparc64-softmmu/exec.o
    CC    sparc-softmmu/cputlb.o
    CC    sparc64-softmmu/translate-all.o
    CC    sparc64-softmmu/cpu-exec.o
    CC    sparc64-softmmu/tcg/tcg.o
    CC    sparc-softmmu/memory_mapping.o
    CC    sparc-softmmu/hw/sparc/leon3.o
    CC    sparc-softmmu/target-sparc/translate.o
    CC    sparc64-softmmu/tcg/optimize.o
    CC    sparc64-softmmu/fpu/softfloat.o
  /tmp/pip-wheel-o8fkn_ru/unicorn_10a6c597b4234e4fadac4c75c0af2a5a/src/qemu/fpu/softfloat.c: In function ‘roundAndPackFloat32_sparc64’:
  /tmp/pip-wheel-o8fkn_ru/unicorn_10a6c597b4234e4fadac4c75c0af2a5a/src/qemu/fpu/softfloat.c:398:41: warning: ‘roundIncrement’ may be used uninitialized in this function [-Wmaybe-uninitialized]
    398 |                   && ( (int32_t) ( zSig + roundIncrement ) < 0 ) )
        |                                  ~~~~~~~^~~~~~~~~~~~~~~~~~
  /tmp/pip-wheel-o8fkn_ru/unicorn_10a6c597b4234e4fadac4c75c0af2a5a/src/qemu/fpu/softfloat.c: In function ‘roundAndPackFloat64_sparc64’:
  /tmp/pip-wheel-o8fkn_ru/unicorn_10a6c597b4234e4fadac4c75c0af2a5a/src/qemu/fpu/softfloat.c:583:41: warning: ‘roundIncrement’ may be used uninitialized in this function [-Wmaybe-uninitialized]
    583 |                   && ( (int64_t) ( zSig + roundIncrement ) < 0 ) )
        |                                  ~~~~~~~^~~~~~~~~~~~~~~~~~
  /tmp/pip-wheel-o8fkn_ru/unicorn_10a6c597b4234e4fadac4c75c0af2a5a/src/qemu/fpu/softfloat.c: In function ‘roundAndPackFloatx80_sparc64’:
  /tmp/pip-wheel-o8fkn_ru/unicorn_10a6c597b4234e4fadac4c75c0af2a5a/src/qemu/fpu/softfloat.c:831:19: warning: ‘increment’ may be used uninitialized in this function [-Wmaybe-uninitialized]
    829 |              || (    ( zExp == 0x7FFE )
        |                 ~~~~~~~~~~~~~~~~~~~~~~~
    830 |                   && ( zSig0 == LIT64( 0xFFFFFFFFFFFFFFFF ) )
        |                   ~~~~~~~~~~~~~~~~~~~~~~~~~~~~~~~~~~~~~~~~~~~
    831 |                   && increment
        |                   ^~~~~~~~~~~~
    832 |                 )
        |                 ~
  /tmp/pip-wheel-o8fkn_ru/unicorn_10a6c597b4234e4fadac4c75c0af2a5a/src/qemu/fpu/softfloat.c: In function ‘roundAndPackFloat128_sparc64’:
  /tmp/pip-wheel-o8fkn_ru/unicorn_10a6c597b4234e4fadac4c75c0af2a5a/src/qemu/fpu/softfloat.c:1098:19: warning: ‘increment’ may be used uninitialized in this function [-Wmaybe-uninitialized]
   1091 |              || (    ( zExp == 0x7FFD )
        |                 ~~~~~~~~~~~~~~~~~~~~~~~
   1092 |                   && eq128(
        |                   ~~~~~~~~~
   1093 |                          LIT64( 0x0001FFFFFFFFFFFF ),
        |                          ~~~~~~~~~~~~~~~~~~~~~~~~~~~~
   1094 |                          LIT64( 0xFFFFFFFFFFFFFFFF ),
        |                          ~~~~~~~~~~~~~~~~~~~~~~~~~~~~
   1095 |                          zSig0,
        |                          ~~~~~~
   1096 |                          zSig1
        |                          ~~~~~
   1097 |                      )
        |                      ~
   1098 |                   && increment
        |                   ^~~~~~~~~~~~
   1099 |                 )
        |                 ~
    CC    sparc-softmmu/target-sparc/helper.o
    CC    sparc-softmmu/target-sparc/cpu.o
    CC    sparc-softmmu/target-sparc/fop_helper.o
    CC    sparc-softmmu/target-sparc/cc_helper.o
    CC    sparc-softmmu/target-sparc/win_helper.o
    CC    sparc-softmmu/target-sparc/mmu_helper.o
    CC    sparc-softmmu/target-sparc/ldst_helper.o
    CC    sparc-softmmu/target-sparc/int32_helper.o
    CC    sparc-softmmu/target-sparc/unicorn.o
    CC    sparc64-softmmu/cpus.o
    CC    mips64el-softmmu/target-mips/lmi_helper.o
    CC    mips64el-softmmu/target-mips/helper.o
    CC    mips64el-softmmu/target-mips/cpu.o
    CC    mips64el-softmmu/target-mips/msa_helper.o
    CC    sparc64-softmmu/ioport.o
    CC    sparc64-softmmu/memory.o
    CC    sparc64-softmmu/cputlb.o
    CC    sparc64-softmmu/memory_mapping.o
    CC    sparc64-softmmu/hw/sparc64/sun4u.o
    CC    sparc64-softmmu/target-sparc/translate.o
    CC    sparc64-softmmu/target-sparc/helper.o
    CC    mips64el-softmmu/target-mips/unicorn.o
    CC    sparc64-softmmu/target-sparc/cpu.o
    CC    sparc64-softmmu/target-sparc/fop_helper.o
    CC    sparc64-softmmu/target-sparc/cc_helper.o
    CC    sparc64-softmmu/target-sparc/win_helper.o
    CC    sparc64-softmmu/target-sparc/mmu_helper.o
    CC    sparc64-softmmu/target-sparc/ldst_helper.o
    CC    sparc64-softmmu/target-sparc/int64_helper.o
    CC    sparc64-softmmu/target-sparc/vis_helper.o
    CC    sparc64-softmmu/target-sparc/unicorn64.o
  make[1]: Leaving directory '/tmp/pip-wheel-o8fkn_ru/unicorn_10a6c597b4234e4fadac4c75c0af2a5a/src/qemu'
    GEN     libunicorn.so.1
    GEN     libunicorn.a
  ar: creating libunicorn.a
  ar: libunicorn.a: No space left on device
  make: *** [Makefile:327: libunicorn.a] Error 1
  error: [Errno 28] No space left on device: 'libunicorn.so' -> '/tmp/pip-wheel-o8fkn_ru/unicorn_10a6c597b4234e4fadac4c75c0af2a5a/unicorn/lib/libunicorn.so'
  ----------------------------------------
  ERROR: Failed building wheel for unicorn
ERROR: Failed to build one or more wheels
Traceback (most recent call last):
  File "/usr/lib/python3.9/site-packages/setuptools/installer.py", line 75, in fetch_build_egg
    subprocess.check_call(cmd)
  File "/usr/lib/python3.9/subprocess.py", line 373, in check_call
    raise CalledProcessError(retcode, cmd)
subprocess.CalledProcessError: Command '['/usr/bin/python', '-m', 'pip', '--disable-pip-version-check', 'wheel', '--no-deps', '-w', '/tmp/tmp4hwhmc_7', '--quiet', 'unicorn==1.0.2rc4']' returned non-zero exit status 1.

The above exception was the direct cause of the following exception:

Traceback (most recent call last):
  File "/build/angr/src/angr-9.0.8021/setup.py", line 135, in <module>
    setup(
  File "/usr/lib/python3.9/site-packages/setuptools/__init__.py", line 152, in setup
    _install_setup_requires(attrs)
  File "/usr/lib/python3.9/site-packages/setuptools/__init__.py", line 147, in _install_setup_requires
    dist.fetch_build_eggs(dist.setup_requires)
  File "/usr/lib/python3.9/site-packages/setuptools/dist.py", line 779, in fetch_build_eggs
    resolved_dists = pkg_resources.working_set.resolve(
  File "/usr/lib/python3.9/site-packages/pkg_resources/__init__.py", line 766, in resolve
    dist = best[req.key] = env.best_match(
  File "/usr/lib/python3.9/site-packages/pkg_resources/__init__.py", line 1051, in best_match
    return self.obtain(req, installer)
  File "/usr/lib/python3.9/site-packages/pkg_resources/__init__.py", line 1063, in obtain
    return installer(requirement)
  File "/usr/lib/python3.9/site-packages/setuptools/dist.py", line 838, in fetch_build_egg
    return fetch_build_egg(self, req)
  File "/usr/lib/python3.9/site-packages/setuptools/installer.py", line 77, in fetch_build_egg
    raise DistutilsError(str(e)) from e
distutils.errors.DistutilsError: Command '['/usr/bin/python', '-m', 'pip', '--disable-pip-version-check', 'wheel', '--no-deps', '-w', '/tmp/tmp4hwhmc_7', '--quiet', 'unicorn==1.0.2rc4']' returned non-zero exit status 1.
==> ERROR: A failure occurred in build().
    Aborting...
==> Removing installed dependencies...
[?25lchecking dependencies...
:: gettext optionally requires git: for autopoint infrastructure updates
:: glib2 optionally requires python: gdbus-codegen, glib-genmarshal, glib-mkenums, gtester-report
:: util-linux optionally requires python: python bindings to libmount

Packages (96) capstone-4.0.2-3  cython-0.29.23-1.1  git-2.32.0-1
              http-parser-2.9.4-1  libgit2-1:1.1.0-1  libnsl-1.3.0-2
              perl-error-0.17029-3  perl-mailtools-2.21-5  perl-timedate-2.33-3
              protobuf-3.17.3-1  python-3.9.5-3  python-ailment-9.0.8021-1
              python-ana-0.06-1  python-appdirs-1.4.4-3
              python-archinfo-9.0.8021-1  python-babel-2.9.1-1
              python-bintrees-2.2.0-1  python-bitstring-3.1.7-3
              python-cachecontrol-0.12.6-3  python-cached-property-1.5.2-3
              python-cachetools-4.2.2-1  python-capstone-4.0.2-3
              python-cffi-1.14.5-1  python-chardet-4.0.0-2
              python-claripy-9.0.8021-1  python-cle-9.0.8021-1
              python-colorama-0.4.4-3  python-contextlib2-0.6.0.post1-3
              python-cooldict-1.04-3  python-cppheaderparser-2.7.4-2
              python-cryptography-3.4.7-1  python-decorator-5.0.9-1
              python-distlib-0.3.2-1  python-distro-1.5.0-3
              python-docutils-0.17.1-1  python-dpkt-git-20210102.r628-1
              python-future-0.18.2-5  python-gitdb-1:4.0.7-1
              python-gitpython-3.1.18-1  python-html5lib-1.1-6
              python-idna-3.2-1  python-imagesize-1.2.0-4
              python-itanium_demangler-1.0-2  python-jinja-3.0.1-1
              python-markupsafe-2.0.1-1  python-mock-3.0.5-6
              python-more-itertools-8.7.0-1  python-msgpack-1.0.2-2
              python-mulpyplexer-0.08-2  python-networkx-2.5.1-2
              python-ordered-set-4.0.2-3  python-packaging-20.9-1
              python-pbr-5.6.0-1  python-pefile-2021.5.24-1
              python-pep517-0.10.0-2  python-pip-20.3.4-1
              python-plumbum-1.7.0-3  python-ply-3.11-7  python-progress-1.5-5
              python-progressbar-3.53.1-5  python-protobuf-3.17.3-1
              python-psutil-5.8.0-1  python-pycparser-2.20-3
              python-pyelftools-0.27-1  python-pygit2-1.6.1-1
              python-pygments-2.9.0-1  python-pyopenssl-20.0.1-1
              python-pyparsing-2.4.7-3  python-pytz-2021.1-1
              python-pyvex-9.0.8021-1  python-requests-2.25.1-1
              python-resolvelib-0.5.5-1  python-retrying-1.3.3-9
              python-rpyc-5.0.1-1  python-setuptools-1:57.0.0-2
              python-six-1.16.0-1  python-smmap-1:4.0.0-1
              python-snowballstemmer-2.1.0-1  python-sortedcontainers-2.4.0-1
              python-sphinx-4.0.2-1  python-sphinx-alabaster-theme-0.7.12-6
              python-sphinxcontrib-applehelp-1.0.2-6
              python-sphinxcontrib-devhelp-1.0.2-6
              python-sphinxcontrib-htmlhelp-2.0.0-1
              python-sphinxcontrib-jsmath-1.0.1-9
              python-sphinxcontrib-qthelp-1.0.3-6
              python-sphinxcontrib-serializinghtml-1.1.5-1
              python-toml-0.10.2-3  python-unicorn-1.0.3-1
              python-urllib3-1.26.5-1  python-utils-2.5.6-1
              python-webencodings-0.5.1-6  python-wheel-0.36.2-1
              python-z3-4.8.11-1  unicorn-1.0.3-1  z3-4.8.11-1

Total Removed Size:  312.72 MiB

:: Do you want to remove these packages? [Y/n] 
:: Processing package changes...
removing python-wheel...
removing python-unicorn...
removing unicorn...
removing python-rpyc...
removing python-pygit2...
removing python-psutil...
removing python-protobuf...
removing python-progressbar...
removing python-utils...
removing python-plumbum...
removing python-pip...
removing python-retrying...
removing python-resolvelib...
removing python-pyopenssl...
removing python-progress...
removing python-pep517...
removing python-toml...
removing python-networkx...
removing python-mulpyplexer...
removing python-itanium_demangler...
removing python-html5lib...
removing python-webencodings...
removing python-gitpython...
removing python-gitdb...
removing python-smmap...
removing python-dpkt-git...
removing python-sphinx...
removing python-sphinxcontrib-serializinghtml...
removing python-sphinxcontrib-qthelp...
removing python-sphinxcontrib-jsmath...
removing python-sphinxcontrib-htmlhelp...
removing python-sphinxcontrib-devhelp...
removing python-sphinxcontrib-applehelp...
removing python-sphinx-alabaster-theme...
removing python-snowballstemmer...
removing python-pygments...
removing python-jinja...
removing python-markupsafe...
removing python-imagesize...
removing python-mock...
removing python-pbr...
removing python-docutils...
removing python-distro...
removing python-setuptools...
removing python-packaging...
removing python-six...
removing python-pyparsing...
removing python-ordered-set...
removing python-more-itertools...
removing python-distlib...
removing python-decorator...
removing python-cryptography...
removing python-cppheaderparser...
removing python-cooldict...
removing python-contextlib2...
removing python-colorama...
removing python-cle...
removing python-sortedcontainers...
removing python-pyelftools...
removing python-pefile...
removing python-claripy...
removing python-z3...
removing z3...
removing python-capstone...
removing python-cachetools...
removing python-cached-property...
removing python-cachecontrol...
removing python-requests...
removing python-urllib3...
removing python-idna...
removing python-chardet...
removing python-msgpack...
removing python-bintrees...
removing python-babel...
removing python-pytz...
removing python-appdirs...
removing python-ana...
removing python-ailment...
removing python-pyvex...
removing python-bitstring...
removing python-cffi...
removing python-pycparser...
removing python-ply...
removing python-archinfo...
removing python-future...
removing protobuf...
removing libgit2...
removing http-parser...
removing git...
removing perl-mailtools...
removing perl-timedate...
removing perl-error...
removing cython...
removing python...
removing libnsl...
removing capstone...
[?25h==> ERROR: Build failed, check /chroot/armv7/build/build