==> Synchronizing chroot copy [/chroot/armv6h/root] -> [build]...done
==> Making package: angr 8.20.7.27-1 (Wed Jul 29 09:23:13 2020)
==> Retrieving sources...
  -> Found angr-8.20.7.27.tar.gz
  -> Found angr.install
==> WARNING: Skipping verification of source file PGP signatures.
==> Validating source files with sha512sums...
    angr-8.20.7.27.tar.gz ... Passed
    angr.install ... Passed
Host and machine ids are equal (2b3dd5a7c7b749ff93431232041f2429): refusing to link journals
==> Making package: angr 8.20.7.27-1 (Wed 29 Jul 2020 09:23:32 AM EDT)
==> Checking runtime dependencies...
==> Installing missing dependencies...
resolving dependencies...
looking for conflicting packages...

Packages (77) capstone-4.0.2-1  git-2.28.0-1  http-parser-2.9.4-1
              libgit2-1:1.0.1-1  libnsl-1.2.0-2  perl-error-0.17029-2
              perl-mailtools-2.21-4  perl-timedate-2.33-2  protobuf-3.12.3-1
              python-3.8.4-1  python-appdirs-1.4.4-1  python-babel-2.8.0-4
              python-bitstring-3.1.7-1  python-cached-property-1.5.1-4
              python-chardet-3.0.4-5  python-decorator-4.4.2-1
              python-docutils-0.16-1  python-future-0.18.2-3
              python-gitdb-1:4.0.5-1  python-idna-2.10-1
              python-imagesize-1.2.0-1  python-jinja-2.11.2-1
              python-markupsafe-1.1.1-4  python-mock-3.0.5-3
              python-ordered-set-4.0.2-1  python-packaging-20.4-1
              python-pbr-5.4.5-1  python-pefile-2019.4.18-2  python-ply-3.11-5
              python-pygments-2.6.1-3  python-pyparsing-2.4.7-1
              python-pytz-2020.1-1  python-requests-2.24.0-1
              python-setuptools-1:49.2.0-1  python-six-1.15.0-1
              python-smmap-1:3.0.4-1  python-snowballstemmer-2.0.0-3
              python-sphinx-3.1.2-1  python-sphinx-alabaster-theme-0.7.12-3
              python-sphinxcontrib-applehelp-1.0.2-1
              python-sphinxcontrib-devhelp-1.0.2-1
              python-sphinxcontrib-htmlhelp-1.0.3-1
              python-sphinxcontrib-jsmath-1.0.1-4
              python-sphinxcontrib-qthelp-1.0.3-1
              python-sphinxcontrib-serializinghtml-1.1.4-1
              python-urllib3-1.25.10-1  python-utils-2.4.0-1  python-z3-4.8.8-1
              unicorn-1.0.1-8  z3-4.8.8-1  python-ailment-8.20.7.27-1
              python-ana-0.05-2  python-archinfo-8.20.7.27-1
              python-bintrees-2.0.7-2  python-cachetools-4.1.1-1
              python-capstone-4.0.2-1  python-cffi-1.14.1-1
              python-claripy-8.20.7.27-1  python-cle-8.20.7.27-1
              python-cooldict-1.04-2  python-cppheaderparser-2.7.4-1
              python-dpkt-git-20200424.r510-1  python-gitpython-3.1.7-1
              python-itanium_demangler-1.0-2  python-mulpyplexer-0.08-2
              python-networkx-2.4-3  python-progressbar-3.51.4-1
              python-protobuf-3.12.3-1  python-psutil-5.7.0-1
              python-pycparser-2.20-1  python-pyelftools-0.26-1
              python-pygit2-1.2.1-1  python-pyvex-8.20.7.27-1
              python-rpyc-4.1.5-1  python-simuvex-7.7.9.8-2
              python-sortedcontainers-2.2.2-1  python-unicorn-1.0.1-8

Total Download Size:    53.05 MiB
Total Installed Size:  317.10 MiB

:: Proceed with installation? [Y/n] 
:: Retrieving packages...
downloading libnsl-1.2.0-2-armv6h.pkg.tar.xz...
downloading python-3.8.4-1-armv6h.pkg.tar.xz...
downloading python-ply-3.11-5-any.pkg.tar.xz...
downloading python-pycparser-2.20-1-any.pkg.tar.xz...
downloading python-cffi-1.14.1-1-armv6h.pkg.tar.xz...
downloading python-pyelftools-0.26-1-any.pkg.tar.xz...
downloading python-six-1.15.0-1-any.pkg.tar.xz...
downloading python-appdirs-1.4.4-1-any.pkg.tar.xz...
downloading python-pyparsing-2.4.7-1-any.pkg.tar.xz...
downloading python-packaging-20.4-1-any.pkg.tar.xz...
downloading python-ordered-set-4.0.2-1-any.pkg.tar.xz...
downloading python-setuptools-1:49.2.0-1-any.pkg.tar.xz...
downloading python-markupsafe-1.1.1-4-armv6h.pkg.tar.xz...
downloading python-urllib3-1.25.10-1-any.pkg.tar.xz...
downloading python-chardet-3.0.4-5-any.pkg.tar.xz...
downloading python-idna-2.10-1-any.pkg.tar.xz...
downloading python-requests-2.24.0-1-any.pkg.tar.xz...
downloading perl-error-0.17029-2-any.pkg.tar.xz...
downloading perl-timedate-2.33-2-any.pkg.tar.xz...
downloading perl-mailtools-2.21-4-any.pkg.tar.xz...
downloading git-2.28.0-1-armv6h.pkg.tar.xz...
downloading protobuf-3.12.3-1-armv6h.pkg.tar.xz...
downloading python-protobuf-3.12.3-1-armv6h.pkg.tar.xz...
downloading http-parser-2.9.4-1-armv6h.pkg.tar.xz...
downloading libgit2-1:1.0.1-1-armv6h.pkg.tar.xz...
downloading python-future-0.18.2-3-any.pkg.tar.xz...
downloading python-bitstring-3.1.7-1-any.pkg.tar.xz...
downloading python-cachetools-4.1.1-1-any.pkg.tar.xz...
downloading capstone-4.0.2-1-armv6h.pkg.tar.xz...
downloading python-capstone-4.0.2-1-armv6h.pkg.tar.xz...
downloading z3-4.8.8-1-armv6h.pkg.tar.xz...
downloading python-z3-4.8.8-1-armv6h.pkg.tar.xz...
downloading python-sortedcontainers-2.2.2-1-any.pkg.tar.xz...
downloading python-pbr-5.4.5-1-any.pkg.tar.xz...
downloading python-mock-3.0.5-3-any.pkg.tar.xz...
downloading python-pytz-2020.1-1-any.pkg.tar.xz...
downloading python-babel-2.8.0-4-any.pkg.tar.xz...
downloading python-docutils-0.16-1-any.pkg.tar.xz...
downloading python-imagesize-1.2.0-1-any.pkg.tar.xz...
downloading python-jinja-2.11.2-1-any.pkg.tar.xz...
downloading python-pygments-2.6.1-3-any.pkg.tar.xz...
downloading python-snowballstemmer-2.0.0-3-any.pkg.tar.xz...
downloading python-sphinx-alabaster-theme-0.7.12-3-any.pkg.tar.xz...
downloading python-sphinxcontrib-applehelp-1.0.2-1-any.pkg.tar.xz...
downloading python-sphinxcontrib-devhelp-1.0.2-1-any.pkg.tar.xz...
downloading python-sphinxcontrib-htmlhelp-1.0.3-1-any.pkg.tar.xz...
downloading python-sphinxcontrib-jsmath-1.0.1-4-any.pkg.tar.xz...
downloading python-sphinxcontrib-qthelp-1.0.3-1-any.pkg.tar.xz...
downloading python-sphinxcontrib-serializinghtml-1.1.4-1-any.pkg.tar.xz...
downloading python-sphinx-3.1.2-1-any.pkg.tar.xz...
downloading python-smmap-1:3.0.4-1-any.pkg.tar.xz...
downloading python-gitdb-1:4.0.5-1-any.pkg.tar.xz...
downloading python-gitpython-3.1.7-1-any.pkg.tar.xz...
downloading python-decorator-4.4.2-1-any.pkg.tar.xz...
downloading python-networkx-2.4-3-any.pkg.tar.xz...
downloading python-utils-2.4.0-1-any.pkg.tar.xz...
downloading python-progressbar-3.51.4-1-any.pkg.tar.xz...
downloading python-psutil-5.7.0-1-armv6h.pkg.tar.xz...
downloading python-cached-property-1.5.1-4-any.pkg.tar.xz...
downloading python-pygit2-1.2.1-1-armv6h.pkg.tar.xz...
downloading unicorn-1.0.1-8-armv6h.pkg.tar.xz...
downloading python-unicorn-1.0.1-8-armv6h.pkg.tar.xz...
downloading python-archinfo-8.20.7.27-1-any.pkg.tar.xz...
downloading python-pyvex-8.20.7.27-1-any.pkg.tar.xz...
downloading python-ailment-8.20.7.27-1-any.pkg.tar.xz...
downloading python-ana-0.05-2-any.pkg.tar.xz...
downloading python-bintrees-2.0.7-2-armv6h.pkg.tar.xz...
downloading python-claripy-8.20.7.27-1-any.pkg.tar.xz...
downloading python-pefile-2019.4.18-2-any.pkg.tar.xz...
downloading python-cle-8.20.7.27-1-any.pkg.tar.xz...
downloading python-cooldict-1.04-2-any.pkg.tar.xz...
downloading python-cppheaderparser-2.7.4-1-any.pkg.tar.xz...
downloading python-dpkt-git-20200424.r510-1-any.pkg.tar.xz...
downloading python-itanium_demangler-1.0-2-any.pkg.tar.xz...
downloading python-mulpyplexer-0.08-2-any.pkg.tar.xz...
downloading python-rpyc-4.1.5-1-any.pkg.tar.xz...
downloading python-simuvex-7.7.9.8-2-any.pkg.tar.xz...
checking keyring...
checking package integrity...
loading package files...
checking for file conflicts...
checking available disk space...
:: Processing package changes...
installing libnsl...
installing python...
Optional dependencies for python
    python-setuptools [pending]
    python-pip
    sqlite [installed]
    mpdecimal: for decimal
    xz: for lzma [installed]
    tk: for tkinter
installing python-ply...
installing python-pycparser...
installing python-future...
Optional dependencies for python-future
    python-setuptools: futurize and pasteurize scripts [pending]
installing python-archinfo...
installing python-cffi...
installing python-bitstring...
installing python-pyvex...
installing python-ailment...
installing python-ana...
installing python-bintrees...
installing python-cachetools...
installing capstone...
installing python-capstone...
installing z3...
installing python-z3...
installing python-claripy...
installing python-pefile...
installing python-pyelftools...
installing python-sortedcontainers...
installing python-cle...
installing python-cooldict...
installing python-cppheaderparser...
installing python-six...
installing python-appdirs...
installing python-pyparsing...
installing python-packaging...
installing python-ordered-set...
installing python-setuptools...
installing python-pbr...
installing python-mock...
installing python-pytz...
installing python-babel...
installing python-docutils...
installing python-imagesize...
installing python-markupsafe...
installing python-jinja...
Optional dependencies for python-jinja
    python-babel: for i18n support [installed]
installing python-pygments...
installing python-urllib3...
Optional dependencies for python-urllib3
    python-pysocks: SOCKS support
    python-brotli: Brotli support
    python-pyopenssl: security support
installing python-chardet...
installing python-idna...
installing python-requests...
Optional dependencies for python-requests
    python-pysocks: SOCKS proxy support
installing python-snowballstemmer...
Optional dependencies for python-snowballstemmer
    python-pystemmer: for improved performance
installing python-sphinx-alabaster-theme...
installing python-sphinxcontrib-applehelp...
installing python-sphinxcontrib-devhelp...
installing python-sphinxcontrib-htmlhelp...
installing python-sphinxcontrib-jsmath...
installing python-sphinxcontrib-qthelp...
installing python-sphinxcontrib-serializinghtml...
installing python-sphinx...
Optional dependencies for python-sphinx
    imagemagick: for ext.imgconverter
    texlive-latexextra: for generation of PDF documentation
installing python-dpkt-git...
installing perl-error...
installing perl-timedate...
installing perl-mailtools...
installing git...
Optional dependencies for git
    tk: gitk and git gui
    perl-libwww: git svn
    perl-term-readkey: git svn and interactive.singlekey setting
    perl-mime-tools: git send-email
    perl-net-smtp-ssl: git send-email TLS support
    perl-authen-sasl: git send-email TLS support
    perl-mediawiki-api: git mediawiki support
    perl-datetime-format-iso8601: git mediawiki support
    perl-lwp-protocol-https: git mediawiki https support
    perl-cgi: gitweb (web interface) support
    python: git svn & git p4 [installed]
    subversion: git svn
    org.freedesktop.secrets: keyring credential helper
    libsecret: libsecret credential helper [installed]
installing python-smmap...
installing python-gitdb...
installing python-gitpython...
installing python-itanium_demangler...
installing python-mulpyplexer...
installing python-decorator...
installing python-networkx...
Optional dependencies for python-networkx
    python-numpy: Provides sparse matrix representation of graphs and many
    numerical scientific tools.
    python-scipy: Provides flexible drawing of graphs.
    python-pyparsing: Required for pydot, GML file reading. [installed]
    python-yaml: Required for YAML format reading and writing.
installing python-utils...
installing python-progressbar...
installing protobuf...
installing python-protobuf...
installing python-psutil...
installing http-parser...
installing libgit2...
installing python-cached-property...
installing python-pygit2...
installing python-rpyc...
installing python-simuvex...
installing unicorn...
installing python-unicorn...
:: Running post-transaction hooks...
(1/4) Creating system user accounts...
Creating group git with gid 977.
Creating user git (git daemon user) with uid 977 and gid 977.
(2/4) Reloading system manager configuration...
  Skipped: Current root is not booted.
(3/4) Arming ConditionNeedsUpdate...
(4/4) Warn about old perl modules
==> Checking buildtime dependencies...
==> Retrieving sources...
  -> Found angr-8.20.7.27.tar.gz
  -> Found angr.install
==> WARNING: Skipping all source file integrity checks.
==> Extracting sources...
  -> Extracting angr-8.20.7.27.tar.gz with bsdtar
==> Starting build()...
WARNING: The pip package is not available, falling back to EasyInstall for handling setup_requires/test_requires; this is deprecated and will be removed in a future version.
/usr/lib/python3.8/site-packages/setuptools/dist.py:458: UserWarning: Normalizing '1.0.2.rc4' to '1.0.2rc4'
  warnings.warn(tmpl.format(**locals()))
cd qemu && \
./configure --cc="cc" --extra-cflags="-DUNICORN_HAS_X86 -DUNICORN_HAS_ARM -DUNICORN_HAS_ARMEB -DUNICORN_HAS_M68K -DUNICORN_HAS_ARM64 -DUNICORN_HAS_ARM64EB -DUNICORN_HAS_MIPS -DUNICORN_HAS_MIPSEL -DUNICORN_HAS_MIPS64 -DUNICORN_HAS_MIPS64EL -DUNICORN_HAS_SPARC -fPIC -fvisibility=hidden" --target-list="x86_64-softmmu, arm-softmmu, armeb-softmmu, m68k-softmmu, aarch64-softmmu, aarch64eb-softmmu, mips-softmmu, mipsel-softmmu, mips64-softmmu, mips64el-softmmu, sparc-softmmu,sparc64-softmmu," 
Source path       /tmp/easy_install-_o0a4olb/unicorn-1.0.2rc4/src/qemu
C compiler        cc
Host C compiler   cc
Objective-C compiler cc
ARFLAGS           rv
CFLAGS            -g -march=armv6 -mfloat-abi=hard -mfpu=vfpv3-d16 -O2 -pipe -fstack-protector --param=ssp-buffer-size=4 -g
QEMU_CFLAGS        -D_GNU_SOURCE -D_FILE_OFFSET_BITS=64 -D_LARGEFILE_SOURCE -Wstrict-prototypes -Wredundant-decls -Wall -Wundef -Wwrite-strings -Wmissing-prototypes -fno-strict-aliasing -fno-common -DUNICORN_HAS_X86 -DUNICORN_HAS_ARM -DUNICORN_HAS_ARMEB -DUNICORN_HAS_M68K -DUNICORN_HAS_ARM64 -DUNICORN_HAS_ARM64EB -DUNICORN_HAS_MIPS -DUNICORN_HAS_MIPSEL -DUNICORN_HAS_MIPS64 -DUNICORN_HAS_MIPS64EL -DUNICORN_HAS_SPARC -fPIC -fvisibility=hidden  -Wendif-labels -Wmissing-include-dirs -Wempty-body -Wnested-externs -Wformat-security -Wformat-y2k -Winit-self -Wignored-qualifiers -Wold-style-declaration -Wold-style-definition -Wtype-limits -fstack-protector-strong
LDFLAGS           -Wl,--warn-common -g -Wl,-O1,--sort-common,--as-needed,-z,relro
make              make
host CPU          arm
host big endian   no
target list       x86_64-softmmu  arm-softmmu  armeb-softmmu  m68k-softmmu  aarch64-softmmu  aarch64eb-softmmu  mips-softmmu  mipsel-softmmu  mips64-softmmu  mips64el-softmmu  sparc-softmmu sparc64-softmmu 
tcg debug enabled no
strip binaries    yes
static build      no
mingw32 support   no
PIE               no
make -C qemu -j4
make[1]: Entering directory '/tmp/easy_install-_o0a4olb/unicorn-1.0.2rc4/src/qemu'
  GEN   x86_64-softmmu/config-devices.mak
  GEN   arm-softmmu/config-devices.mak
  GEN   m68k-softmmu/config-devices.mak
  GEN   armeb-softmmu/config-devices.mak
  GEN   aarch64-softmmu/config-devices.mak
  GEN   aarch64eb-softmmu/config-devices.mak
  GEN   mips-softmmu/config-devices.mak
  GEN   mipsel-softmmu/config-devices.mak
  GEN   mips64-softmmu/config-devices.mak
  GEN   sparc-softmmu/config-devices.mak
  GEN   mips64el-softmmu/config-devices.mak
  GEN   sparc64-softmmu/config-devices.mak
  GEN   config-host.h
  GEN   config-all-devices.mak
  CC    accel.o
  CC    vl.o
  CC    qemu-timer.o
  CC    ../uc.o
  CC    ../list.o
  CC    glib_compat.o
  CC    qemu-log.o
  CC    tcg-runtime.o
  CC    hw/core/qdev.o
  CC    hw/core/machine.o
  CC    qom/object.o
  CC    qom/container.o
  CC    qom/qom-qobject.o
  CC    qom/cpu.o
  CC    qapi-types.o
  CC    qapi-visit.o
  CC    qapi/qapi-visit-core.o
  CC    qapi/qapi-dealloc-visitor.o
  CC    qapi/qmp-input-visitor.o
  CC    qapi/qmp-output-visitor.o
  CC    qapi/string-input-visitor.o
  CC    qobject/qint.o
  CC    qobject/qstring.o
  CC    qobject/qdict.o
  CC    qobject/qlist.o
  CC    qobject/qfloat.o
  CC    qobject/qbool.o
  CC    qobject/qerror.o
  CC    util/cutils.o
  CC    util/qemu-timer-common.o
  CC    util/oslib-posix.o
  CC    util/qemu-thread-posix.o
  CC    util/module.o
  CC    util/bitmap.o
  CC    util/bitops.o
  CC    util/error.o
  CC    util/aes.o
  CC    util/crc32c.o
  CC    util/host-utils.o
  CC    util/getauxval.o
  GEN   armeb-softmmu/config-target.h
  GEN   m68k-softmmu/config-target.h
  GEN   arm-softmmu/config-target.h
  GEN   x86_64-softmmu/config-target.h
  CC    armeb-softmmu/exec.o
  CC    arm-softmmu/exec.o
  CC    m68k-softmmu/exec.o
  CC    x86_64-softmmu/exec.o
  CC    m68k-softmmu/translate-all.o
  CC    arm-softmmu/translate-all.o
  CC    armeb-softmmu/translate-all.o
  CC    x86_64-softmmu/translate-all.o
  CC    m68k-softmmu/cpu-exec.o
  CC    arm-softmmu/cpu-exec.o
  CC    armeb-softmmu/cpu-exec.o
  CC    x86_64-softmmu/cpu-exec.o
  CC    m68k-softmmu/tcg/tcg.o
  CC    arm-softmmu/tcg/tcg.o
  CC    armeb-softmmu/tcg/tcg.o
  CC    x86_64-softmmu/tcg/tcg.o
  CC    m68k-softmmu/tcg/optimize.o
  CC    arm-softmmu/tcg/optimize.o
  CC    armeb-softmmu/tcg/optimize.o
  CC    x86_64-softmmu/tcg/optimize.o
  CC    m68k-softmmu/fpu/softfloat.o
  CC    arm-softmmu/fpu/softfloat.o
  CC    armeb-softmmu/fpu/softfloat.o
  CC    x86_64-softmmu/fpu/softfloat.o
/tmp/easy_install-_o0a4olb/unicorn-1.0.2rc4/src/qemu/fpu/softfloat.c: In function ‘roundAndPackFloat32_m68k’:
/tmp/easy_install-_o0a4olb/unicorn-1.0.2rc4/src/qemu/fpu/softfloat.c:371:10: warning: roundIncrement’ may be used uninitialized in this function [-Wmaybe-uninitialized]
  371 |     int8 roundIncrement, roundBits;
      |          ^~~~~~~~~~~~~~
/tmp/easy_install-_o0a4olb/unicorn-1.0.2rc4/src/qemu/fpu/softfloat.c: In function ‘roundAndPackFloat64_m68k’:
/tmp/easy_install-_o0a4olb/unicorn-1.0.2rc4/src/qemu/fpu/softfloat.c:556:18: warning: roundIncrement’ may be used uninitialized in this function [-Wmaybe-uninitialized]
  556 |     int_fast16_t roundIncrement, roundBits;
      |                  ^~~~~~~~~~~~~~
/tmp/easy_install-_o0a4olb/unicorn-1.0.2rc4/src/qemu/fpu/softfloat.c: In function ‘roundAndPackFloatx80_m68k’:
/tmp/easy_install-_o0a4olb/unicorn-1.0.2rc4/src/qemu/fpu/softfloat.c:831:19: warning: increment’ may be used uninitialized in this function [-Wmaybe-uninitialized]
  829 |              || (    ( zExp == 0x7FFE )
      |                 ~~~~~~~~~~~~~~~~~~~~~~~
  830 |                   && ( zSig0 == LIT64( 0xFFFFFFFFFFFFFFFF ) )
      |                   ~~~~~~~~~~~~~~~~~~~~~~~~~~~~~~~~~~~~~~~~~~~
  831 |                   && increment
      |                   ^~~~~~~~~~~~
  832 |                 )
      |                 ~  
/tmp/easy_install-_o0a4olb/unicorn-1.0.2rc4/src/qemu/fpu/softfloat.c: In function ‘roundAndPackFloat128_m68k’:
/tmp/easy_install-_o0a4olb/unicorn-1.0.2rc4/src/qemu/fpu/softfloat.c:1098:19: warning: increment’ may be used uninitialized in this function [-Wmaybe-uninitialized]
 1091 |              || (    ( zExp == 0x7FFD )
      |                 ~~~~~~~~~~~~~~~~~~~~~~~
 1092 |                   && eq128(
      |                   ~~~~~~~~~
 1093 |                          LIT64( 0x0001FFFFFFFFFFFF ),
      |                          ~~~~~~~~~~~~~~~~~~~~~~~~~~~~
 1094 |                          LIT64( 0xFFFFFFFFFFFFFFFF ),
      |                          ~~~~~~~~~~~~~~~~~~~~~~~~~~~~
 1095 |                          zSig0,
      |                          ~~~~~~
 1096 |                          zSig1
      |                          ~~~~~
 1097 |                      )
      |                      ~
 1098 |                   && increment
      |                   ^~~~~~~~~~~~
 1099 |                 )
      |                 ~  
/tmp/easy_install-_o0a4olb/unicorn-1.0.2rc4/src/qemu/fpu/softfloat.c: In function ‘roundAndPackFloat32_arm’:
/tmp/easy_install-_o0a4olb/unicorn-1.0.2rc4/src/qemu/fpu/softfloat.c:371:10: warning: roundIncrement’ may be used uninitialized in this function [-Wmaybe-uninitialized]
  371 |     int8 roundIncrement, roundBits;
      |          ^~~~~~~~~~~~~~
/tmp/easy_install-_o0a4olb/unicorn-1.0.2rc4/src/qemu/fpu/softfloat.c: In function ‘roundAndPackFloat64_arm’:
/tmp/easy_install-_o0a4olb/unicorn-1.0.2rc4/src/qemu/fpu/softfloat.c:556:18: warning: roundIncrement’ may be used uninitialized in this function [-Wmaybe-uninitialized]
  556 |     int_fast16_t roundIncrement, roundBits;
      |                  ^~~~~~~~~~~~~~
/tmp/easy_install-_o0a4olb/unicorn-1.0.2rc4/src/qemu/fpu/softfloat.c: In function ‘roundAndPackFloat32_armeb’:
/tmp/easy_install-_o0a4olb/unicorn-1.0.2rc4/src/qemu/fpu/softfloat.c:371:10: warning: roundIncrement’ may be used uninitialized in this function [-Wmaybe-uninitialized]
  371 |     int8 roundIncrement, roundBits;
      |          ^~~~~~~~~~~~~~
/tmp/easy_install-_o0a4olb/unicorn-1.0.2rc4/src/qemu/fpu/softfloat.c: In function ‘roundAndPackFloatx80_arm’:
/tmp/easy_install-_o0a4olb/unicorn-1.0.2rc4/src/qemu/fpu/softfloat.c:831:19: warning: increment’ may be used uninitialized in this function [-Wmaybe-uninitialized]
  829 |              || (    ( zExp == 0x7FFE )
      |                 ~~~~~~~~~~~~~~~~~~~~~~~
  830 |                   && ( zSig0 == LIT64( 0xFFFFFFFFFFFFFFFF ) )
      |                   ~~~~~~~~~~~~~~~~~~~~~~~~~~~~~~~~~~~~~~~~~~~
  831 |                   && increment
      |                   ^~~~~~~~~~~~
  832 |                 )
      |                 ~  
/tmp/easy_install-_o0a4olb/unicorn-1.0.2rc4/src/qemu/fpu/softfloat.c: In function ‘roundAndPackFloat64_armeb’:
/tmp/easy_install-_o0a4olb/unicorn-1.0.2rc4/src/qemu/fpu/softfloat.c:556:18: warning: roundIncrement’ may be used uninitialized in this function [-Wmaybe-uninitialized]
  556 |     int_fast16_t roundIncrement, roundBits;
      |                  ^~~~~~~~~~~~~~
/tmp/easy_install-_o0a4olb/unicorn-1.0.2rc4/src/qemu/fpu/softfloat.c: In function ‘roundAndPackFloatx80_armeb’:
/tmp/easy_install-_o0a4olb/unicorn-1.0.2rc4/src/qemu/fpu/softfloat.c:831:19: warning: increment’ may be used uninitialized in this function [-Wmaybe-uninitialized]
  829 |              || (    ( zExp == 0x7FFE )
      |                 ~~~~~~~~~~~~~~~~~~~~~~~
  830 |                   && ( zSig0 == LIT64( 0xFFFFFFFFFFFFFFFF ) )
      |                   ~~~~~~~~~~~~~~~~~~~~~~~~~~~~~~~~~~~~~~~~~~~
  831 |                   && increment
      |                   ^~~~~~~~~~~~
  832 |                 )
      |                 ~  
/tmp/easy_install-_o0a4olb/unicorn-1.0.2rc4/src/qemu/fpu/softfloat.c: In function ‘roundAndPackFloat128_arm’:
/tmp/easy_install-_o0a4olb/unicorn-1.0.2rc4/src/qemu/fpu/softfloat.c:1098:19: warning: increment’ may be used uninitialized in this function [-Wmaybe-uninitialized]
 1091 |              || (    ( zExp == 0x7FFD )
      |                 ~~~~~~~~~~~~~~~~~~~~~~~
 1092 |                   && eq128(
      |                   ~~~~~~~~~
 1093 |                          LIT64( 0x0001FFFFFFFFFFFF ),
      |                          ~~~~~~~~~~~~~~~~~~~~~~~~~~~~
 1094 |                          LIT64( 0xFFFFFFFFFFFFFFFF ),
      |                          ~~~~~~~~~~~~~~~~~~~~~~~~~~~~
 1095 |                          zSig0,
      |                          ~~~~~~
 1096 |                          zSig1
      |                          ~~~~~
 1097 |                      )
      |                      ~
 1098 |                   && increment
      |                   ^~~~~~~~~~~~
 1099 |                 )
      |                 ~  
/tmp/easy_install-_o0a4olb/unicorn-1.0.2rc4/src/qemu/fpu/softfloat.c: In function ‘roundAndPackFloat128_armeb’:
/tmp/easy_install-_o0a4olb/unicorn-1.0.2rc4/src/qemu/fpu/softfloat.c:1098:19: warning: increment’ may be used uninitialized in this function [-Wmaybe-uninitialized]
 1091 |              || (    ( zExp == 0x7FFD )
      |                 ~~~~~~~~~~~~~~~~~~~~~~~
 1092 |                   && eq128(
      |                   ~~~~~~~~~
 1093 |                          LIT64( 0x0001FFFFFFFFFFFF ),
      |                          ~~~~~~~~~~~~~~~~~~~~~~~~~~~~
 1094 |                          LIT64( 0xFFFFFFFFFFFFFFFF ),
      |                          ~~~~~~~~~~~~~~~~~~~~~~~~~~~~
 1095 |                          zSig0,
      |                          ~~~~~~
 1096 |                          zSig1
      |                          ~~~~~
 1097 |                      )
      |                      ~
 1098 |                   && increment
      |                   ^~~~~~~~~~~~
 1099 |                 )
      |                 ~  
/tmp/easy_install-_o0a4olb/unicorn-1.0.2rc4/src/qemu/fpu/softfloat.c: In function ‘roundAndPackFloat32_x86_64’:
/tmp/easy_install-_o0a4olb/unicorn-1.0.2rc4/src/qemu/fpu/softfloat.c:371:10: warning: roundIncrement’ may be used uninitialized in this function [-Wmaybe-uninitialized]
  371 |     int8 roundIncrement, roundBits;
      |          ^~~~~~~~~~~~~~
/tmp/easy_install-_o0a4olb/unicorn-1.0.2rc4/src/qemu/fpu/softfloat.c: In function ‘roundAndPackFloat64_x86_64’:
/tmp/easy_install-_o0a4olb/unicorn-1.0.2rc4/src/qemu/fpu/softfloat.c:556:18: warning: roundIncrement’ may be used uninitialized in this function [-Wmaybe-uninitialized]
  556 |     int_fast16_t roundIncrement, roundBits;
      |                  ^~~~~~~~~~~~~~
/tmp/easy_install-_o0a4olb/unicorn-1.0.2rc4/src/qemu/fpu/softfloat.c: In function ‘roundAndPackFloatx80_x86_64’:
/tmp/easy_install-_o0a4olb/unicorn-1.0.2rc4/src/qemu/fpu/softfloat.c:831:19: warning: increment’ may be used uninitialized in this function [-Wmaybe-uninitialized]
  829 |              || (    ( zExp == 0x7FFE )
      |                 ~~~~~~~~~~~~~~~~~~~~~~~
  830 |                   && ( zSig0 == LIT64( 0xFFFFFFFFFFFFFFFF ) )
      |                   ~~~~~~~~~~~~~~~~~~~~~~~~~~~~~~~~~~~~~~~~~~~
  831 |                   && increment
      |                   ^~~~~~~~~~~~
  832 |                 )
      |                 ~  
/tmp/easy_install-_o0a4olb/unicorn-1.0.2rc4/src/qemu/fpu/softfloat.c: In function ‘roundAndPackFloat128_x86_64’:
/tmp/easy_install-_o0a4olb/unicorn-1.0.2rc4/src/qemu/fpu/softfloat.c:1098:19: warning: increment’ may be used uninitialized in this function [-Wmaybe-uninitialized]
 1091 |              || (    ( zExp == 0x7FFD )
      |                 ~~~~~~~~~~~~~~~~~~~~~~~
 1092 |                   && eq128(
      |                   ~~~~~~~~~
 1093 |                          LIT64( 0x0001FFFFFFFFFFFF ),
      |                          ~~~~~~~~~~~~~~~~~~~~~~~~~~~~
 1094 |                          LIT64( 0xFFFFFFFFFFFFFFFF ),
      |                          ~~~~~~~~~~~~~~~~~~~~~~~~~~~~
 1095 |                          zSig0,
      |                          ~~~~~~
 1096 |                          zSig1
      |                          ~~~~~
 1097 |                      )
      |                      ~
 1098 |                   && increment
      |                   ^~~~~~~~~~~~
 1099 |                 )
      |                 ~  
  CC    m68k-softmmu/cpus.o
  CC    m68k-softmmu/ioport.o
  CC    arm-softmmu/cpus.o
  CC    m68k-softmmu/memory.o
  CC    arm-softmmu/ioport.o
  CC    x86_64-softmmu/cpus.o
  CC    arm-softmmu/memory.o
  CC    armeb-softmmu/cpus.o
  CC    x86_64-softmmu/ioport.o
  CC    armeb-softmmu/ioport.o
  CC    x86_64-softmmu/memory.o
  CC    armeb-softmmu/memory.o
  CC    m68k-softmmu/cputlb.o
  CC    arm-softmmu/cputlb.o
  CC    armeb-softmmu/cputlb.o
  CC    x86_64-softmmu/cputlb.o
  CC    m68k-softmmu/memory_mapping.o
  CC    m68k-softmmu/hw/m68k/dummy_m68k.o
  CC    m68k-softmmu/target-m68k/translate.o
  CC    arm-softmmu/memory_mapping.o
  CC    arm-softmmu/hw/arm/tosa.o
  CC    armeb-softmmu/memory_mapping.o
  CC    arm-softmmu/hw/arm/virt.o
  CC    armeb-softmmu/hw/arm/tosa.o
  CC    arm-softmmu/target-arm/translate.o
  CC    x86_64-softmmu/memory_mapping.o
  CC    armeb-softmmu/hw/arm/virt.o
  CC    x86_64-softmmu/hw/intc/apic.o
  CC    armeb-softmmu/target-arm/translate.o
  CC    x86_64-softmmu/hw/intc/apic_common.o
  CC    x86_64-softmmu/hw/i386/pc.o
  CC    x86_64-softmmu/hw/i386/pc_piix.o
  CC    x86_64-softmmu/target-i386/translate.o
  CC    m68k-softmmu/target-m68k/op_helper.o
  CC    m68k-softmmu/target-m68k/helper.o
  CC    m68k-softmmu/target-m68k/cpu.o
  CC    m68k-softmmu/target-m68k/unicorn.o
  CC    x86_64-softmmu/target-i386/helper.o
  CC    x86_64-softmmu/target-i386/cpu.o
  CC    x86_64-softmmu/target-i386/excp_helper.o
  CC    x86_64-softmmu/target-i386/fpu_helper.o
  CC    x86_64-softmmu/target-i386/cc_helper.o
  CC    x86_64-softmmu/target-i386/int_helper.o
  CC    x86_64-softmmu/target-i386/svm_helper.o
  CC    x86_64-softmmu/target-i386/smm_helper.o
  CC    x86_64-softmmu/target-i386/misc_helper.o
  CC    x86_64-softmmu/target-i386/mem_helper.o
  CC    x86_64-softmmu/target-i386/seg_helper.o
  CC    x86_64-softmmu/target-i386/arch_memory_mapping.o
  CC    x86_64-softmmu/target-i386/unicorn.o
  GEN   aarch64-softmmu/config-target.h
  CC    aarch64-softmmu/exec.o
  CC    arm-softmmu/target-arm/op_helper.o
  CC    aarch64-softmmu/translate-all.o
  CC    armeb-softmmu/target-arm/op_helper.o
  CC    aarch64-softmmu/cpu-exec.o
  CC    arm-softmmu/target-arm/helper.o
  CC    aarch64-softmmu/tcg/tcg.o
  CC    armeb-softmmu/target-arm/helper.o
  CC    aarch64-softmmu/tcg/optimize.o
  CC    armeb-softmmu/target-arm/cpu.o
  CC    arm-softmmu/target-arm/cpu.o
  CC    armeb-softmmu/target-arm/neon_helper.o
  CC    arm-softmmu/target-arm/neon_helper.o
  CC    aarch64-softmmu/fpu/softfloat.o
/tmp/easy_install-_o0a4olb/unicorn-1.0.2rc4/src/qemu/fpu/softfloat.c: In function ‘roundAndPackFloat32_aarch64’:
/tmp/easy_install-_o0a4olb/unicorn-1.0.2rc4/src/qemu/fpu/softfloat.c:371:10: warning: roundIncrement’ may be used uninitialized in this function [-Wmaybe-uninitialized]
  371 |     int8 roundIncrement, roundBits;
      |          ^~~~~~~~~~~~~~
/tmp/easy_install-_o0a4olb/unicorn-1.0.2rc4/src/qemu/fpu/softfloat.c: In function ‘roundAndPackFloat64_aarch64’:
/tmp/easy_install-_o0a4olb/unicorn-1.0.2rc4/src/qemu/fpu/softfloat.c:556:18: warning: roundIncrement’ may be used uninitialized in this function [-Wmaybe-uninitialized]
  556 |     int_fast16_t roundIncrement, roundBits;
      |                  ^~~~~~~~~~~~~~
/tmp/easy_install-_o0a4olb/unicorn-1.0.2rc4/src/qemu/fpu/softfloat.c: In function ‘roundAndPackFloatx80_aarch64’:
/tmp/easy_install-_o0a4olb/unicorn-1.0.2rc4/src/qemu/fpu/softfloat.c:831:19: warning: increment’ may be used uninitialized in this function [-Wmaybe-uninitialized]
  829 |              || (    ( zExp == 0x7FFE )
      |                 ~~~~~~~~~~~~~~~~~~~~~~~
  830 |                   && ( zSig0 == LIT64( 0xFFFFFFFFFFFFFFFF ) )
      |                   ~~~~~~~~~~~~~~~~~~~~~~~~~~~~~~~~~~~~~~~~~~~
  831 |                   && increment
      |                   ^~~~~~~~~~~~
  832 |                 )
      |                 ~  
/tmp/easy_install-_o0a4olb/unicorn-1.0.2rc4/src/qemu/fpu/softfloat.c: In function ‘roundAndPackFloat128_aarch64’:
/tmp/easy_install-_o0a4olb/unicorn-1.0.2rc4/src/qemu/fpu/softfloat.c:1098:19: warning: increment’ may be used uninitialized in this function [-Wmaybe-uninitialized]
 1091 |              || (    ( zExp == 0x7FFD )
      |                 ~~~~~~~~~~~~~~~~~~~~~~~
 1092 |                   && eq128(
      |                   ~~~~~~~~~
 1093 |                          LIT64( 0x0001FFFFFFFFFFFF ),
      |                          ~~~~~~~~~~~~~~~~~~~~~~~~~~~~
 1094 |                          LIT64( 0xFFFFFFFFFFFFFFFF ),
      |                          ~~~~~~~~~~~~~~~~~~~~~~~~~~~~
 1095 |                          zSig0,
      |                          ~~~~~~
 1096 |                          zSig1
      |                          ~~~~~
 1097 |                      )
      |                      ~
 1098 |                   && increment
      |                   ^~~~~~~~~~~~
 1099 |                 )
      |                 ~  
  CC    armeb-softmmu/target-arm/iwmmxt_helper.o
  CC    arm-softmmu/target-arm/iwmmxt_helper.o
  CC    armeb-softmmu/target-arm/psci.o
  CC    armeb-softmmu/target-arm/unicorn_arm.o
  CC    arm-softmmu/target-arm/psci.o
  CC    arm-softmmu/target-arm/unicorn_arm.o
  CC    armeb-softmmu/target-arm/crypto_helper.o
  CC    arm-softmmu/target-arm/crypto_helper.o
  GEN   aarch64eb-softmmu/config-target.h
  CC    aarch64eb-softmmu/exec.o
  GEN   mips-softmmu/config-target.h
  CC    mips-softmmu/exec.o
  CC    aarch64eb-softmmu/translate-all.o
  CC    mips-softmmu/translate-all.o
  CC    aarch64eb-softmmu/cpu-exec.o
  CC    aarch64-softmmu/cpus.o
  CC    mips-softmmu/cpu-exec.o
  CC    aarch64-softmmu/ioport.o
  CC    aarch64eb-softmmu/tcg/tcg.o
  CC    aarch64-softmmu/memory.o
  CC    mips-softmmu/tcg/tcg.o
  CC    aarch64-softmmu/cputlb.o
  CC    aarch64eb-softmmu/tcg/optimize.o
  CC    mips-softmmu/tcg/optimize.o
  CC    aarch64-softmmu/memory_mapping.o
  CC    aarch64-softmmu/hw/arm/tosa.o
  CC    aarch64-softmmu/hw/arm/virt.o
  CC    aarch64-softmmu/target-arm/translate.o
  CC    aarch64eb-softmmu/fpu/softfloat.o
  CC    mips-softmmu/fpu/softfloat.o
/tmp/easy_install-_o0a4olb/unicorn-1.0.2rc4/src/qemu/fpu/softfloat.c: In function ‘roundAndPackFloat32_aarch64eb’:
/tmp/easy_install-_o0a4olb/unicorn-1.0.2rc4/src/qemu/fpu/softfloat.c:371:10: warning: roundIncrement’ may be used uninitialized in this function [-Wmaybe-uninitialized]
  371 |     int8 roundIncrement, roundBits;
      |          ^~~~~~~~~~~~~~
/tmp/easy_install-_o0a4olb/unicorn-1.0.2rc4/src/qemu/fpu/softfloat.c: In function ‘roundAndPackFloat64_aarch64eb’:
/tmp/easy_install-_o0a4olb/unicorn-1.0.2rc4/src/qemu/fpu/softfloat.c:556:18: warning: roundIncrement’ may be used uninitialized in this function [-Wmaybe-uninitialized]
  556 |     int_fast16_t roundIncrement, roundBits;
      |                  ^~~~~~~~~~~~~~
/tmp/easy_install-_o0a4olb/unicorn-1.0.2rc4/src/qemu/fpu/softfloat.c: In function ‘roundAndPackFloatx80_aarch64eb’:
/tmp/easy_install-_o0a4olb/unicorn-1.0.2rc4/src/qemu/fpu/softfloat.c:831:19: warning: increment’ may be used uninitialized in this function [-Wmaybe-uninitialized]
  829 |              || (    ( zExp == 0x7FFE )
      |                 ~~~~~~~~~~~~~~~~~~~~~~~
  830 |                   && ( zSig0 == LIT64( 0xFFFFFFFFFFFFFFFF ) )
      |                   ~~~~~~~~~~~~~~~~~~~~~~~~~~~~~~~~~~~~~~~~~~~
  831 |                   && increment
      |                   ^~~~~~~~~~~~
  832 |                 )
      |                 ~  
/tmp/easy_install-_o0a4olb/unicorn-1.0.2rc4/src/qemu/fpu/softfloat.c: In function ‘roundAndPackFloat128_aarch64eb’:
/tmp/easy_install-_o0a4olb/unicorn-1.0.2rc4/src/qemu/fpu/softfloat.c:1098:19: warning: increment’ may be used uninitialized in this function [-Wmaybe-uninitialized]
 1091 |              || (    ( zExp == 0x7FFD )
      |                 ~~~~~~~~~~~~~~~~~~~~~~~
 1092 |                   && eq128(
      |                   ~~~~~~~~~
 1093 |                          LIT64( 0x0001FFFFFFFFFFFF ),
      |                          ~~~~~~~~~~~~~~~~~~~~~~~~~~~~
 1094 |                          LIT64( 0xFFFFFFFFFFFFFFFF ),
      |                          ~~~~~~~~~~~~~~~~~~~~~~~~~~~~
 1095 |                          zSig0,
      |                          ~~~~~~
 1096 |                          zSig1
      |                          ~~~~~
 1097 |                      )
      |                      ~
 1098 |                   && increment
      |                   ^~~~~~~~~~~~
 1099 |                 )
      |                 ~  
/tmp/easy_install-_o0a4olb/unicorn-1.0.2rc4/src/qemu/fpu/softfloat.c: In function ‘roundAndPackFloat32_mips’:
/tmp/easy_install-_o0a4olb/unicorn-1.0.2rc4/src/qemu/fpu/softfloat.c:371:10: warning: roundIncrement’ may be used uninitialized in this function [-Wmaybe-uninitialized]
  371 |     int8 roundIncrement, roundBits;
      |          ^~~~~~~~~~~~~~
/tmp/easy_install-_o0a4olb/unicorn-1.0.2rc4/src/qemu/fpu/softfloat.c: In function ‘roundAndPackFloat64_mips’:
/tmp/easy_install-_o0a4olb/unicorn-1.0.2rc4/src/qemu/fpu/softfloat.c:556:18: warning: roundIncrement’ may be used uninitialized in this function [-Wmaybe-uninitialized]
  556 |     int_fast16_t roundIncrement, roundBits;
      |                  ^~~~~~~~~~~~~~
/tmp/easy_install-_o0a4olb/unicorn-1.0.2rc4/src/qemu/fpu/softfloat.c: In function ‘roundAndPackFloatx80_mips’:
/tmp/easy_install-_o0a4olb/unicorn-1.0.2rc4/src/qemu/fpu/softfloat.c:831:19: warning: increment’ may be used uninitialized in this function [-Wmaybe-uninitialized]
  829 |              || (    ( zExp == 0x7FFE )
      |                 ~~~~~~~~~~~~~~~~~~~~~~~
  830 |                   && ( zSig0 == LIT64( 0xFFFFFFFFFFFFFFFF ) )
      |                   ~~~~~~~~~~~~~~~~~~~~~~~~~~~~~~~~~~~~~~~~~~~
  831 |                   && increment
      |                   ^~~~~~~~~~~~
  832 |                 )
      |                 ~  
/tmp/easy_install-_o0a4olb/unicorn-1.0.2rc4/src/qemu/fpu/softfloat.c: In function ‘roundAndPackFloat128_mips’:
/tmp/easy_install-_o0a4olb/unicorn-1.0.2rc4/src/qemu/fpu/softfloat.c:1098:19: warning: increment’ may be used uninitialized in this function [-Wmaybe-uninitialized]
 1091 |              || (    ( zExp == 0x7FFD )
      |                 ~~~~~~~~~~~~~~~~~~~~~~~
 1092 |                   && eq128(
      |                   ~~~~~~~~~
 1093 |                          LIT64( 0x0001FFFFFFFFFFFF ),
      |                          ~~~~~~~~~~~~~~~~~~~~~~~~~~~~
 1094 |                          LIT64( 0xFFFFFFFFFFFFFFFF ),
      |                          ~~~~~~~~~~~~~~~~~~~~~~~~~~~~
 1095 |                          zSig0,
      |                          ~~~~~~
 1096 |                          zSig1
      |                          ~~~~~
 1097 |                      )
      |                      ~
 1098 |                   && increment
      |                   ^~~~~~~~~~~~
 1099 |                 )
      |                 ~  
  CC    aarch64eb-softmmu/cpus.o
  CC    aarch64eb-softmmu/ioport.o
  CC    aarch64eb-softmmu/memory.o
  CC    mips-softmmu/cpus.o
  CC    mips-softmmu/ioport.o
  CC    mips-softmmu/memory.o
  CC    aarch64eb-softmmu/cputlb.o
  CC    mips-softmmu/cputlb.o
  CC    aarch64-softmmu/target-arm/op_helper.o
  CC    mips-softmmu/memory_mapping.o
  CC    mips-softmmu/hw/mips/mips_r4k.o
  CC    mips-softmmu/hw/mips/addr.o
  CC    mips-softmmu/hw/mips/cputimer.o
  CC    aarch64eb-softmmu/memory_mapping.o
  CC    mips-softmmu/target-mips/translate.o
  CC    aarch64eb-softmmu/hw/arm/tosa.o
  GEN   mipsel-softmmu/config-target.h
  CC    mipsel-softmmu/exec.o
  CC    aarch64eb-softmmu/hw/arm/virt.o
  CC    aarch64eb-softmmu/target-arm/translate.o
  CC    mipsel-softmmu/translate-all.o
  CC    mipsel-softmmu/cpu-exec.o
  CC    mipsel-softmmu/tcg/tcg.o
  CC    mipsel-softmmu/tcg/optimize.o
  CC    mipsel-softmmu/fpu/softfloat.o
/tmp/easy_install-_o0a4olb/unicorn-1.0.2rc4/src/qemu/fpu/softfloat.c: In function ‘roundAndPackFloat32_mipsel’:
/tmp/easy_install-_o0a4olb/unicorn-1.0.2rc4/src/qemu/fpu/softfloat.c:371:10: warning: roundIncrement’ may be used uninitialized in this function [-Wmaybe-uninitialized]
  371 |     int8 roundIncrement, roundBits;
      |          ^~~~~~~~~~~~~~
/tmp/easy_install-_o0a4olb/unicorn-1.0.2rc4/src/qemu/fpu/softfloat.c: In function ‘roundAndPackFloat64_mipsel’:
/tmp/easy_install-_o0a4olb/unicorn-1.0.2rc4/src/qemu/fpu/softfloat.c:556:18: warning: roundIncrement’ may be used uninitialized in this function [-Wmaybe-uninitialized]
  556 |     int_fast16_t roundIncrement, roundBits;
      |                  ^~~~~~~~~~~~~~
/tmp/easy_install-_o0a4olb/unicorn-1.0.2rc4/src/qemu/fpu/softfloat.c: In function ‘roundAndPackFloatx80_mipsel’:
/tmp/easy_install-_o0a4olb/unicorn-1.0.2rc4/src/qemu/fpu/softfloat.c:831:19: warning: increment’ may be used uninitialized in this function [-Wmaybe-uninitialized]
  829 |              || (    ( zExp == 0x7FFE )
      |                 ~~~~~~~~~~~~~~~~~~~~~~~
  830 |                   && ( zSig0 == LIT64( 0xFFFFFFFFFFFFFFFF ) )
      |                   ~~~~~~~~~~~~~~~~~~~~~~~~~~~~~~~~~~~~~~~~~~~
  831 |                   && increment
      |                   ^~~~~~~~~~~~
  832 |                 )
      |                 ~  
/tmp/easy_install-_o0a4olb/unicorn-1.0.2rc4/src/qemu/fpu/softfloat.c: In function ‘roundAndPackFloat128_mipsel’:
/tmp/easy_install-_o0a4olb/unicorn-1.0.2rc4/src/qemu/fpu/softfloat.c:1098:19: warning: increment’ may be used uninitialized in this function [-Wmaybe-uninitialized]
 1091 |              || (    ( zExp == 0x7FFD )
      |                 ~~~~~~~~~~~~~~~~~~~~~~~
 1092 |                   && eq128(
      |                   ~~~~~~~~~
 1093 |                          LIT64( 0x0001FFFFFFFFFFFF ),
      |                          ~~~~~~~~~~~~~~~~~~~~~~~~~~~~
 1094 |                          LIT64( 0xFFFFFFFFFFFFFFFF ),
      |                          ~~~~~~~~~~~~~~~~~~~~~~~~~~~~
 1095 |                          zSig0,
      |                          ~~~~~~
 1096 |                          zSig1
      |                          ~~~~~
 1097 |                      )
      |                      ~
 1098 |                   && increment
      |                   ^~~~~~~~~~~~
 1099 |                 )
      |                 ~  
  CC    mipsel-softmmu/cpus.o
  CC    mipsel-softmmu/ioport.o
  CC    mipsel-softmmu/memory.o
  CC    aarch64-softmmu/target-arm/helper.o
  CC    mipsel-softmmu/cputlb.o
  CC    mipsel-softmmu/memory_mapping.o
  CC    mipsel-softmmu/hw/mips/mips_r4k.o
  CC    mipsel-softmmu/hw/mips/addr.o
  CC    mipsel-softmmu/hw/mips/cputimer.o
  CC    mipsel-softmmu/target-mips/translate.o
  CC    aarch64-softmmu/target-arm/cpu.o
  CC    aarch64-softmmu/target-arm/neon_helper.o
  CC    aarch64-softmmu/target-arm/iwmmxt_helper.o
  CC    aarch64-softmmu/target-arm/psci.o
  CC    aarch64-softmmu/target-arm/cpu64.o
  CC    aarch64-softmmu/target-arm/translate-a64.o
  CC    aarch64eb-softmmu/target-arm/op_helper.o
  CC    aarch64eb-softmmu/target-arm/helper.o
  CC    aarch64eb-softmmu/target-arm/cpu.o
  CC    aarch64eb-softmmu/target-arm/neon_helper.o
  CC    aarch64eb-softmmu/target-arm/iwmmxt_helper.o
  CC    aarch64eb-softmmu/target-arm/psci.o
  CC    aarch64eb-softmmu/target-arm/cpu64.o
  CC    aarch64eb-softmmu/target-arm/translate-a64.o
  CC    mips-softmmu/target-mips/dsp_helper.o
  CC    aarch64-softmmu/target-arm/helper-a64.o
  CC    aarch64-softmmu/target-arm/unicorn_aarch64.o
  CC    mips-softmmu/target-mips/op_helper.o
  CC    aarch64-softmmu/target-arm/crypto_helper.o
  GEN   mips64-softmmu/config-target.h
  CC    mips64-softmmu/exec.o
  CC    mips64-softmmu/translate-all.o
  CC    mips64-softmmu/cpu-exec.o
  CC    mips64-softmmu/tcg/tcg.o
  CC    mips-softmmu/target-mips/lmi_helper.o
  CC    mips64-softmmu/tcg/optimize.o
  CC    mips-softmmu/target-mips/helper.o
  CC    mips-softmmu/target-mips/cpu.o
  CC    mips-softmmu/target-mips/msa_helper.o
  CC    mips64-softmmu/fpu/softfloat.o
/tmp/easy_install-_o0a4olb/unicorn-1.0.2rc4/src/qemu/fpu/softfloat.c: In function ‘roundAndPackFloat32_mips64’:
/tmp/easy_install-_o0a4olb/unicorn-1.0.2rc4/src/qemu/fpu/softfloat.c:371:10: warning: roundIncrement’ may be used uninitialized in this function [-Wmaybe-uninitialized]
  371 |     int8 roundIncrement, roundBits;
      |          ^~~~~~~~~~~~~~
/tmp/easy_install-_o0a4olb/unicorn-1.0.2rc4/src/qemu/fpu/softfloat.c: In function ‘roundAndPackFloat64_mips64’:
/tmp/easy_install-_o0a4olb/unicorn-1.0.2rc4/src/qemu/fpu/softfloat.c:556:18: warning: roundIncrement’ may be used uninitialized in this function [-Wmaybe-uninitialized]
  556 |     int_fast16_t roundIncrement, roundBits;
      |                  ^~~~~~~~~~~~~~
/tmp/easy_install-_o0a4olb/unicorn-1.0.2rc4/src/qemu/fpu/softfloat.c: In function ‘roundAndPackFloatx80_mips64’:
/tmp/easy_install-_o0a4olb/unicorn-1.0.2rc4/src/qemu/fpu/softfloat.c:831:19: warning: increment’ may be used uninitialized in this function [-Wmaybe-uninitialized]
  829 |              || (    ( zExp == 0x7FFE )
      |                 ~~~~~~~~~~~~~~~~~~~~~~~
  830 |                   && ( zSig0 == LIT64( 0xFFFFFFFFFFFFFFFF ) )
      |                   ~~~~~~~~~~~~~~~~~~~~~~~~~~~~~~~~~~~~~~~~~~~
  831 |                   && increment
      |                   ^~~~~~~~~~~~
  832 |                 )
      |                 ~  
/tmp/easy_install-_o0a4olb/unicorn-1.0.2rc4/src/qemu/fpu/softfloat.c: In function ‘roundAndPackFloat128_mips64’:
/tmp/easy_install-_o0a4olb/unicorn-1.0.2rc4/src/qemu/fpu/softfloat.c:1098:19: warning: increment’ may be used uninitialized in this function [-Wmaybe-uninitialized]
 1091 |              || (    ( zExp == 0x7FFD )
      |                 ~~~~~~~~~~~~~~~~~~~~~~~
 1092 |                   && eq128(
      |                   ~~~~~~~~~
 1093 |                          LIT64( 0x0001FFFFFFFFFFFF ),
      |                          ~~~~~~~~~~~~~~~~~~~~~~~~~~~~
 1094 |                          LIT64( 0xFFFFFFFFFFFFFFFF ),
      |                          ~~~~~~~~~~~~~~~~~~~~~~~~~~~~
 1095 |                          zSig0,
      |                          ~~~~~~
 1096 |                          zSig1
      |                          ~~~~~
 1097 |                      )
      |                      ~
 1098 |                   && increment
      |                   ^~~~~~~~~~~~
 1099 |                 )
      |                 ~  
  CC    aarch64eb-softmmu/target-arm/helper-a64.o
  CC    aarch64eb-softmmu/target-arm/unicorn_aarch64.o
  CC    aarch64eb-softmmu/target-arm/crypto_helper.o
  CC    mips64-softmmu/cpus.o
  CC    mips-softmmu/target-mips/unicorn.o
  CC    mips64-softmmu/ioport.o
  GEN   mips64el-softmmu/config-target.h
  CC    mips64el-softmmu/exec.o
  CC    mips64el-softmmu/translate-all.o
  CC    mips64el-softmmu/cpu-exec.o
  CC    mips64-softmmu/memory.o
  CC    mips64el-softmmu/tcg/tcg.o
  CC    mips64-softmmu/cputlb.o
  CC    mips64-softmmu/memory_mapping.o
  CC    mips64el-softmmu/tcg/optimize.o
  GEN   sparc-softmmu/config-target.h
  CC    sparc-softmmu/exec.o
  CC    mips64-softmmu/hw/mips/mips_r4k.o
  CC    mips64-softmmu/hw/mips/addr.o
  CC    mips64-softmmu/hw/mips/cputimer.o
  CC    mipsel-softmmu/target-mips/dsp_helper.o
  CC    mips64-softmmu/target-mips/translate.o
  CC    mips64el-softmmu/fpu/softfloat.o
  CC    sparc-softmmu/translate-all.o
  CC    mipsel-softmmu/target-mips/op_helper.o
  CC    sparc-softmmu/cpu-exec.o
/tmp/easy_install-_o0a4olb/unicorn-1.0.2rc4/src/qemu/fpu/softfloat.c: In function ‘roundAndPackFloat32_mips64el’:
/tmp/easy_install-_o0a4olb/unicorn-1.0.2rc4/src/qemu/fpu/softfloat.c:371:10: warning: roundIncrement’ may be used uninitialized in this function [-Wmaybe-uninitialized]
  371 |     int8 roundIncrement, roundBits;
      |          ^~~~~~~~~~~~~~
/tmp/easy_install-_o0a4olb/unicorn-1.0.2rc4/src/qemu/fpu/softfloat.c: In function ‘roundAndPackFloat64_mips64el’:
/tmp/easy_install-_o0a4olb/unicorn-1.0.2rc4/src/qemu/fpu/softfloat.c:556:18: warning: roundIncrement’ may be used uninitialized in this function [-Wmaybe-uninitialized]
  556 |     int_fast16_t roundIncrement, roundBits;
      |                  ^~~~~~~~~~~~~~
/tmp/easy_install-_o0a4olb/unicorn-1.0.2rc4/src/qemu/fpu/softfloat.c: In function ‘roundAndPackFloatx80_mips64el’:
/tmp/easy_install-_o0a4olb/unicorn-1.0.2rc4/src/qemu/fpu/softfloat.c:831:19: warning: increment’ may be used uninitialized in this function [-Wmaybe-uninitialized]
  829 |              || (    ( zExp == 0x7FFE )
      |                 ~~~~~~~~~~~~~~~~~~~~~~~
  830 |                   && ( zSig0 == LIT64( 0xFFFFFFFFFFFFFFFF ) )
      |                   ~~~~~~~~~~~~~~~~~~~~~~~~~~~~~~~~~~~~~~~~~~~
  831 |                   && increment
      |                   ^~~~~~~~~~~~
  832 |                 )
      |                 ~  
  CC    sparc-softmmu/tcg/tcg.o
/tmp/easy_install-_o0a4olb/unicorn-1.0.2rc4/src/qemu/fpu/softfloat.c: In function ‘roundAndPackFloat128_mips64el’:
/tmp/easy_install-_o0a4olb/unicorn-1.0.2rc4/src/qemu/fpu/softfloat.c:1098:19: warning: increment’ may be used uninitialized in this function [-Wmaybe-uninitialized]
 1091 |              || (    ( zExp == 0x7FFD )
      |                 ~~~~~~~~~~~~~~~~~~~~~~~
 1092 |                   && eq128(
      |                   ~~~~~~~~~
 1093 |                          LIT64( 0x0001FFFFFFFFFFFF ),
      |                          ~~~~~~~~~~~~~~~~~~~~~~~~~~~~
 1094 |                          LIT64( 0xFFFFFFFFFFFFFFFF ),
      |                          ~~~~~~~~~~~~~~~~~~~~~~~~~~~~
 1095 |                          zSig0,
      |                          ~~~~~~
 1096 |                          zSig1
      |                          ~~~~~
 1097 |                      )
      |                      ~
 1098 |                   && increment
      |                   ^~~~~~~~~~~~
 1099 |                 )
      |                 ~  
  CC    sparc-softmmu/tcg/optimize.o
  CC    sparc-softmmu/fpu/softfloat.o
/tmp/easy_install-_o0a4olb/unicorn-1.0.2rc4/src/qemu/fpu/softfloat.c: In function ‘roundAndPackFloat32_sparc’:
/tmp/easy_install-_o0a4olb/unicorn-1.0.2rc4/src/qemu/fpu/softfloat.c:371:10: warning: roundIncrement’ may be used uninitialized in this function [-Wmaybe-uninitialized]
  371 |     int8 roundIncrement, roundBits;
      |          ^~~~~~~~~~~~~~
/tmp/easy_install-_o0a4olb/unicorn-1.0.2rc4/src/qemu/fpu/softfloat.c: In function ‘roundAndPackFloat64_sparc’:
/tmp/easy_install-_o0a4olb/unicorn-1.0.2rc4/src/qemu/fpu/softfloat.c:556:18: warning: roundIncrement’ may be used uninitialized in this function [-Wmaybe-uninitialized]
  556 |     int_fast16_t roundIncrement, roundBits;
      |                  ^~~~~~~~~~~~~~
/tmp/easy_install-_o0a4olb/unicorn-1.0.2rc4/src/qemu/fpu/softfloat.c: In function ‘roundAndPackFloatx80_sparc’:
/tmp/easy_install-_o0a4olb/unicorn-1.0.2rc4/src/qemu/fpu/softfloat.c:831:19: warning: increment’ may be used uninitialized in this function [-Wmaybe-uninitialized]
  829 |              || (    ( zExp == 0x7FFE )
      |                 ~~~~~~~~~~~~~~~~~~~~~~~
  830 |                   && ( zSig0 == LIT64( 0xFFFFFFFFFFFFFFFF ) )
      |                   ~~~~~~~~~~~~~~~~~~~~~~~~~~~~~~~~~~~~~~~~~~~
  831 |                   && increment
      |                   ^~~~~~~~~~~~
  832 |                 )
      |                 ~  
/tmp/easy_install-_o0a4olb/unicorn-1.0.2rc4/src/qemu/fpu/softfloat.c: In function ‘roundAndPackFloat128_sparc’:
/tmp/easy_install-_o0a4olb/unicorn-1.0.2rc4/src/qemu/fpu/softfloat.c:1098:19: warning: increment’ may be used uninitialized in this function [-Wmaybe-uninitialized]
 1091 |              || (    ( zExp == 0x7FFD )
      |                 ~~~~~~~~~~~~~~~~~~~~~~~
 1092 |                   && eq128(
      |                   ~~~~~~~~~
 1093 |                          LIT64( 0x0001FFFFFFFFFFFF ),
      |                          ~~~~~~~~~~~~~~~~~~~~~~~~~~~~
 1094 |                          LIT64( 0xFFFFFFFFFFFFFFFF ),
      |                          ~~~~~~~~~~~~~~~~~~~~~~~~~~~~
 1095 |                          zSig0,
      |                          ~~~~~~
 1096 |                          zSig1
      |                          ~~~~~
 1097 |                      )
      |                      ~
 1098 |                   && increment
      |                   ^~~~~~~~~~~~
 1099 |                 )
      |                 ~  
  CC    mips64el-softmmu/cpus.o
  CC    mips64el-softmmu/ioport.o
  CC    mips64el-softmmu/memory.o
  CC    mipsel-softmmu/target-mips/lmi_helper.o
  CC    mipsel-softmmu/target-mips/helper.o
  CC    mipsel-softmmu/target-mips/cpu.o
  CC    mipsel-softmmu/target-mips/msa_helper.o
  CC    mips64el-softmmu/cputlb.o
  CC    mips64el-softmmu/memory_mapping.o
  CC    mips64el-softmmu/hw/mips/mips_r4k.o
  CC    mips64el-softmmu/hw/mips/addr.o
  CC    mips64el-softmmu/hw/mips/cputimer.o
  CC    mips64el-softmmu/target-mips/translate.o
  CC    sparc-softmmu/cpus.o
  CC    sparc-softmmu/ioport.o
  CC    sparc-softmmu/memory.o
  CC    sparc-softmmu/cputlb.o
  CC    sparc-softmmu/memory_mapping.o
  CC    sparc-softmmu/hw/sparc/leon3.o
  CC    sparc-softmmu/target-sparc/translate.o
  CC    mipsel-softmmu/target-mips/unicorn.o
  CC    mips64el-softmmu/target-mips/dsp_helper.o
  CC    mips64el-softmmu/target-mips/op_helper.o
  CC    sparc-softmmu/target-sparc/helper.o
  CC    sparc-softmmu/target-sparc/cpu.o
  CC    sparc-softmmu/target-sparc/fop_helper.o
  CC    sparc-softmmu/target-sparc/cc_helper.o
  CC    sparc-softmmu/target-sparc/win_helper.o
  CC    sparc-softmmu/target-sparc/mmu_helper.o
  CC    sparc-softmmu/target-sparc/ldst_helper.o
  CC    sparc-softmmu/target-sparc/int32_helper.o
  CC    sparc-softmmu/target-sparc/unicorn.o
  GEN   sparc64-softmmu/config-target.h
  CC    sparc64-softmmu/exec.o
  CC    sparc64-softmmu/translate-all.o
  CC    sparc64-softmmu/cpu-exec.o
  CC    mips64el-softmmu/target-mips/lmi_helper.o
  CC    sparc64-softmmu/tcg/tcg.o
  CC    mips64el-softmmu/target-mips/helper.o
  CC    mips64el-softmmu/target-mips/cpu.o
  CC    mips64el-softmmu/target-mips/msa_helper.o
  CC    sparc64-softmmu/tcg/optimize.o
  CC    sparc64-softmmu/fpu/softfloat.o
/tmp/easy_install-_o0a4olb/unicorn-1.0.2rc4/src/qemu/fpu/softfloat.c: In function ‘roundAndPackFloat32_sparc64’:
/tmp/easy_install-_o0a4olb/unicorn-1.0.2rc4/src/qemu/fpu/softfloat.c:371:10: warning: roundIncrement’ may be used uninitialized in this function [-Wmaybe-uninitialized]
  371 |     int8 roundIncrement, roundBits;
      |          ^~~~~~~~~~~~~~
/tmp/easy_install-_o0a4olb/unicorn-1.0.2rc4/src/qemu/fpu/softfloat.c: In function ‘roundAndPackFloat64_sparc64’:
/tmp/easy_install-_o0a4olb/unicorn-1.0.2rc4/src/qemu/fpu/softfloat.c:556:18: warning: roundIncrement’ may be used uninitialized in this function [-Wmaybe-uninitialized]
  556 |     int_fast16_t roundIncrement, roundBits;
      |                  ^~~~~~~~~~~~~~
/tmp/easy_install-_o0a4olb/unicorn-1.0.2rc4/src/qemu/fpu/softfloat.c: In function ‘roundAndPackFloatx80_sparc64’:
/tmp/easy_install-_o0a4olb/unicorn-1.0.2rc4/src/qemu/fpu/softfloat.c:831:19: warning: increment’ may be used uninitialized in this function [-Wmaybe-uninitialized]
  829 |              || (    ( zExp == 0x7FFE )
      |                 ~~~~~~~~~~~~~~~~~~~~~~~
  830 |                   && ( zSig0 == LIT64( 0xFFFFFFFFFFFFFFFF ) )
      |                   ~~~~~~~~~~~~~~~~~~~~~~~~~~~~~~~~~~~~~~~~~~~
  831 |                   && increment
      |                   ^~~~~~~~~~~~
  832 |                 )
      |                 ~  
/tmp/easy_install-_o0a4olb/unicorn-1.0.2rc4/src/qemu/fpu/softfloat.c: In function ‘roundAndPackFloat128_sparc64’:
/tmp/easy_install-_o0a4olb/unicorn-1.0.2rc4/src/qemu/fpu/softfloat.c:1098:19: warning: increment’ may be used uninitialized in this function [-Wmaybe-uninitialized]
 1091 |              || (    ( zExp == 0x7FFD )
      |                 ~~~~~~~~~~~~~~~~~~~~~~~
 1092 |                   && eq128(
      |                   ~~~~~~~~~
 1093 |                          LIT64( 0x0001FFFFFFFFFFFF ),
      |                          ~~~~~~~~~~~~~~~~~~~~~~~~~~~~
 1094 |                          LIT64( 0xFFFFFFFFFFFFFFFF ),
      |                          ~~~~~~~~~~~~~~~~~~~~~~~~~~~~
 1095 |                          zSig0,
      |                          ~~~~~~
 1096 |                          zSig1
      |                          ~~~~~
 1097 |                      )
      |                      ~
 1098 |                   && increment
      |                   ^~~~~~~~~~~~
 1099 |                 )
      |                 ~  
  CC    sparc64-softmmu/cpus.o
  CC    sparc64-softmmu/ioport.o
  CC    sparc64-softmmu/memory.o
  CC    mips64el-softmmu/target-mips/unicorn.o
  CC    sparc64-softmmu/cputlb.o
  CC    mips64-softmmu/target-mips/dsp_helper.o
  CC    sparc64-softmmu/memory_mapping.o
  CC    sparc64-softmmu/hw/sparc64/sun4u.o
  CC    sparc64-softmmu/target-sparc/translate.o
  CC    mips64-softmmu/target-mips/op_helper.o
  CC    mips64-softmmu/target-mips/lmi_helper.o
  CC    mips64-softmmu/target-mips/helper.o
  CC    mips64-softmmu/target-mips/cpu.o
  CC    mips64-softmmu/target-mips/msa_helper.o
  CC    mips64-softmmu/target-mips/unicorn.o
  CC    sparc64-softmmu/target-sparc/helper.o
  CC    sparc64-softmmu/target-sparc/cpu.o
  CC    sparc64-softmmu/target-sparc/fop_helper.o
  CC    sparc64-softmmu/target-sparc/cc_helper.o
  CC    sparc64-softmmu/target-sparc/win_helper.o
  CC    sparc64-softmmu/target-sparc/mmu_helper.o
  CC    sparc64-softmmu/target-sparc/ldst_helper.o
  CC    sparc64-softmmu/target-sparc/int64_helper.o
  CC    sparc64-softmmu/target-sparc/vis_helper.o
  CC    sparc64-softmmu/target-sparc/unicorn64.o
{standard input}: Assembler messages:
{standard input}:1091160: Warning: end of file not at end of a line; newline inserted
{standard input}:1091552: Error: unknown pseudo-op: `.lbb35'
{standard input}: Error: open CFI at the end of file; missing .cfi_endproc directive
cc: fatal error: Killed signal terminated program cc1
compilation terminated.
make[2]: *** [/tmp/easy_install-_o0a4olb/unicorn-1.0.2rc4/src/qemu/rules.mak:54: target-mips/translate.o] Error 1
make[1]: *** [Makefile:84: subdir-mips64-softmmu] Error 2
make[1]: *** Waiting for unfinished jobs....
make[1]: Leaving directory '/tmp/easy_install-_o0a4olb/unicorn-1.0.2rc4/src/qemu'
make: *** [Makefile:297: uc.o] Error 2
Traceback (most recent call last):
  File "/usr/lib/python3.8/site-packages/setuptools/installer.py", line 62, in fetch_build_egg
    pkg_resources.get_distribution('pip')
  File "/usr/lib/python3.8/site-packages/pkg_resources/__init__.py", line 480, in get_distribution
    dist = get_provider(dist)
  File "/usr/lib/python3.8/site-packages/pkg_resources/__init__.py", line 356, in get_provider
    return working_set.find(moduleOrReq) or require(str(moduleOrReq))[0]
  File "/usr/lib/python3.8/site-packages/pkg_resources/__init__.py", line 899, in require
    needed = self.resolve(parse_requirements(requirements))
  File "/usr/lib/python3.8/site-packages/pkg_resources/__init__.py", line 785, in resolve
    raise DistributionNotFound(req, requirers)
pkg_resources.DistributionNotFound: The 'pip' distribution was not found and is required by the application

During handling of the above exception, another exception occurred:

Traceback (most recent call last):
  File "/usr/lib/python3.8/distutils/core.py", line 148, in setup
    dist.run_commands()
  File "/usr/lib/python3.8/distutils/dist.py", line 966, in run_commands
    self.run_command(cmd)
  File "/usr/lib/python3.8/distutils/dist.py", line 985, in run_command
    cmd_obj.run()
  File "/tmp/easy_install-_o0a4olb/unicorn-1.0.2rc4/setup.py", line 212, in run
  File "/usr/lib/python3.8/distutils/cmd.py", line 313, in run_command
    self.distribution.run_command(command)
  File "/usr/lib/python3.8/distutils/dist.py", line 985, in run_command
    cmd_obj.run()
  File "/tmp/easy_install-_o0a4olb/unicorn-1.0.2rc4/setup.py", line 207, in run
  File "/tmp/easy_install-_o0a4olb/unicorn-1.0.2rc4/setup.py", line 182, in build_libraries
  File "/usr/lib/python3.8/shutil.py", line 415, in copy
    copyfile(src, dst, follow_symlinks=follow_symlinks)
  File "/usr/lib/python3.8/shutil.py", line 261, in copyfile
    with open(src, 'rb') as fsrc, open(dst, 'wb') as fdst:
  File "/usr/lib/python3.8/site-packages/setuptools/sandbox.py", line 419, in _open
    return _open(path, mode, *args, **kw)
FileNotFoundError: [Errno 2] No such file or directory: 'libunicorn.so'

During handling of the above exception, another exception occurred:

Traceback (most recent call last):
  File "/usr/lib/python3.8/site-packages/setuptools/sandbox.py", line 154, in save_modules
    yield saved
  File "/usr/lib/python3.8/site-packages/setuptools/sandbox.py", line 195, in setup_context
    yield
  File "/usr/lib/python3.8/site-packages/setuptools/sandbox.py", line 250, in run_setup
    _execfile(setup_script, ns)
  File "/usr/lib/python3.8/site-packages/setuptools/sandbox.py", line 45, in _execfile
    exec(code, globals, locals)
  File "/tmp/easy_install-_o0a4olb/unicorn-1.0.2rc4/setup.py", line 275, in <module>
  File "/usr/lib/python3.8/distutils/core.py", line 156, in setup
    raise SystemExit("error: %s" % (exc,))
SystemExit: error: [Errno 2] No such file or directory: 'libunicorn.so'

During handling of the above exception, another exception occurred:

Traceback (most recent call last):
  File "/usr/lib/python3.8/site-packages/setuptools/command/easy_install.py", line 1151, in run_setup
    run_setup(setup_script, args)
  File "/usr/lib/python3.8/site-packages/setuptools/sandbox.py", line 253, in run_setup
    raise
  File "/usr/lib/python3.8/contextlib.py", line 131, in __exit__
    self.gen.throw(type, value, traceback)
  File "/usr/lib/python3.8/site-packages/setuptools/sandbox.py", line 195, in setup_context
    yield
  File "/usr/lib/python3.8/contextlib.py", line 131, in __exit__
    self.gen.throw(type, value, traceback)
  File "/usr/lib/python3.8/site-packages/setuptools/sandbox.py", line 166, in save_modules
    saved_exc.resume()
  File "/usr/lib/python3.8/site-packages/setuptools/sandbox.py", line 141, in resume
    six.reraise(type, exc, self._tb)
  File "/usr/lib/python3.8/site-packages/six.py", line 702, in reraise
    raise value.with_traceback(tb)
  File "/usr/lib/python3.8/site-packages/setuptools/sandbox.py", line 154, in save_modules
    yield saved
  File "/usr/lib/python3.8/site-packages/setuptools/sandbox.py", line 195, in setup_context
    yield
  File "/usr/lib/python3.8/site-packages/setuptools/sandbox.py", line 250, in run_setup
    _execfile(setup_script, ns)
  File "/usr/lib/python3.8/site-packages/setuptools/sandbox.py", line 45, in _execfile
    exec(code, globals, locals)
  File "/tmp/easy_install-_o0a4olb/unicorn-1.0.2rc4/setup.py", line 275, in <module>
  File "/usr/lib/python3.8/distutils/core.py", line 156, in setup
    raise SystemExit("error: %s" % (exc,))
SystemExit: error: [Errno 2] No such file or directory: 'libunicorn.so'

The above exception was the direct cause of the following exception:

Traceback (most recent call last):
  File "setup.py", line 134, in <module>
    setup(
  File "/usr/lib/python3.8/site-packages/setuptools/__init__.py", line 164, in setup
    _install_setup_requires(attrs)
  File "/usr/lib/python3.8/site-packages/setuptools/__init__.py", line 159, in _install_setup_requires
    dist.fetch_build_eggs(dist.setup_requires)
  File "/usr/lib/python3.8/site-packages/setuptools/dist.py", line 699, in fetch_build_eggs
    resolved_dists = pkg_resources.working_set.resolve(
  File "/usr/lib/python3.8/site-packages/pkg_resources/__init__.py", line 779, in resolve
    dist = best[req.key] = env.best_match(
  File "/usr/lib/python3.8/site-packages/pkg_resources/__init__.py", line 1064, in best_match
    return self.obtain(req, installer)
  File "/usr/lib/python3.8/site-packages/pkg_resources/__init__.py", line 1076, in obtain
    return installer(requirement)
  File "/usr/lib/python3.8/site-packages/setuptools/dist.py", line 758, in fetch_build_egg
    return fetch_build_egg(self, req)
  File "/usr/lib/python3.8/site-packages/setuptools/installer.py", line 70, in fetch_build_egg
    return _legacy_fetch_build_egg(dist, req)
  File "/usr/lib/python3.8/site-packages/setuptools/installer.py", line 53, in _legacy_fetch_build_egg
    return cmd.easy_install(req)
  File "/usr/lib/python3.8/site-packages/setuptools/command/easy_install.py", line 686, in easy_install
    return self.install_item(spec, dist.location, tmpdir, deps)
  File "/usr/lib/python3.8/site-packages/setuptools/command/easy_install.py", line 712, in install_item
    dists = self.install_eggs(spec, download, tmpdir)
  File "/usr/lib/python3.8/site-packages/setuptools/command/easy_install.py", line 897, in install_eggs
    return self.build_and_install(setup_script, setup_base)
  File "/usr/lib/python3.8/site-packages/setuptools/command/easy_install.py", line 1167, in build_and_install
    self.run_setup(setup_script, setup_base, args)
  File "/usr/lib/python3.8/site-packages/setuptools/command/easy_install.py", line 1153, in run_setup
    raise DistutilsError(
distutils.errors.DistutilsError: Setup script exited with error: [Errno 2] No such file or directory: 'libunicorn.so'
==> ERROR: A failure occurred in build().
    Aborting...
==> Removing installed dependencies...
checking dependencies...
:: gettext optionally requires git: for autopoint infrastructure updates
:: glib2 optionally requires python: gdbus-codegen, glib-genmarshal, glib-mkenums, gtester-report
:: util-linux optionally requires python: python bindings to libmount

Packages (77) capstone-4.0.2-1  git-2.28.0-1  http-parser-2.9.4-1
              libgit2-1:1.0.1-1  libnsl-1.2.0-2  perl-error-0.17029-2
              perl-mailtools-2.21-4  perl-timedate-2.33-2  protobuf-3.12.3-1
              python-3.8.4-1  python-ailment-8.20.7.27-1  python-ana-0.05-2
              python-appdirs-1.4.4-1  python-archinfo-8.20.7.27-1
              python-babel-2.8.0-4  python-bintrees-2.0.7-2
              python-bitstring-3.1.7-1  python-cached-property-1.5.1-4
              python-cachetools-4.1.1-1  python-capstone-4.0.2-1
              python-cffi-1.14.1-1  python-chardet-3.0.4-5
              python-claripy-8.20.7.27-1  python-cle-8.20.7.27-1
              python-cooldict-1.04-2  python-cppheaderparser-2.7.4-1
              python-decorator-4.4.2-1  python-docutils-0.16-1
              python-dpkt-git-20200424.r510-1  python-future-0.18.2-3
              python-gitdb-1:4.0.5-1  python-gitpython-3.1.7-1
              python-idna-2.10-1  python-imagesize-1.2.0-1
              python-itanium_demangler-1.0-2  python-jinja-2.11.2-1
              python-markupsafe-1.1.1-4  python-mock-3.0.5-3
              python-mulpyplexer-0.08-2  python-networkx-2.4-3
              python-ordered-set-4.0.2-1  python-packaging-20.4-1
              python-pbr-5.4.5-1  python-pefile-2019.4.18-2  python-ply-3.11-5
              python-progressbar-3.51.4-1  python-protobuf-3.12.3-1
              python-psutil-5.7.0-1  python-pycparser-2.20-1
              python-pyelftools-0.26-1  python-pygit2-1.2.1-1
              python-pygments-2.6.1-3  python-pyparsing-2.4.7-1
              python-pytz-2020.1-1  python-pyvex-8.20.7.27-1
              python-requests-2.24.0-1  python-rpyc-4.1.5-1
              python-setuptools-1:49.2.0-1  python-simuvex-7.7.9.8-2
              python-six-1.15.0-1  python-smmap-1:3.0.4-1
              python-snowballstemmer-2.0.0-3  python-sortedcontainers-2.2.2-1
              python-sphinx-3.1.2-1  python-sphinx-alabaster-theme-0.7.12-3
              python-sphinxcontrib-applehelp-1.0.2-1
              python-sphinxcontrib-devhelp-1.0.2-1
              python-sphinxcontrib-htmlhelp-1.0.3-1
              python-sphinxcontrib-jsmath-1.0.1-4
              python-sphinxcontrib-qthelp-1.0.3-1
              python-sphinxcontrib-serializinghtml-1.1.4-1
              python-unicorn-1.0.1-8  python-urllib3-1.25.10-1
              python-utils-2.4.0-1  python-z3-4.8.8-1  unicorn-1.0.1-8
              z3-4.8.8-1

Total Removed Size:  317.10 MiB

:: Do you want to remove these packages? [Y/n] 
:: Processing package changes...
removing python-unicorn...
removing unicorn...
removing python-simuvex...
removing python-rpyc...
removing python-pygit2...
removing python-psutil...
removing python-protobuf...
removing python-progressbar...
removing python-utils...
removing python-networkx...
removing python-mulpyplexer...
removing python-itanium_demangler...
removing python-gitpython...
removing python-gitdb...
removing python-smmap...
removing python-dpkt-git...
removing python-sphinx...
removing python-sphinxcontrib-serializinghtml...
removing python-sphinxcontrib-qthelp...
removing python-sphinxcontrib-jsmath...
removing python-sphinxcontrib-htmlhelp...
removing python-sphinxcontrib-devhelp...
removing python-sphinxcontrib-applehelp...
removing python-sphinx-alabaster-theme...
removing python-snowballstemmer...
removing python-requests...
removing python-urllib3...
removing python-idna...
removing python-pygments...
removing python-jinja...
removing python-markupsafe...
removing python-imagesize...
removing python-mock...
removing python-pbr...
removing python-docutils...
removing python-decorator...
removing python-cppheaderparser...
removing python-cooldict...
removing python-cle...
removing python-sortedcontainers...
removing python-pyelftools...
removing python-pefile...
removing python-claripy...
removing python-z3...
removing z3...
removing python-chardet...
removing python-setuptools...
removing python-packaging...
removing python-six...
removing python-pyparsing...
removing python-ordered-set...
removing python-capstone...
removing python-cachetools...
removing python-cached-property...
removing python-bintrees...
removing python-babel...
removing python-pytz...
removing python-appdirs...
removing python-ana...
removing python-ailment...
removing python-pyvex...
removing python-bitstring...
removing python-cffi...
removing python-pycparser...
removing python-ply...
removing python-archinfo...
removing python-future...
removing python...
removing protobuf...
removing libnsl...
removing libgit2...
removing http-parser...
removing git...
removing perl-mailtools...
removing perl-timedate...
removing perl-error...
removing capstone...
:: Running post-transaction hooks...
(1/2) Reloading system manager configuration...
  Skipped: Current root is not booted.
(2/2) Arming ConditionNeedsUpdate...
==> ERROR: Build failed, check /chroot/armv6h/build/build